{"text_format":"1","workbook":"xlsx","n_sheets":3,"sheets":["Pots","Draw","Rankings - ELO Model"],"not_rendered":{"charts":0,"images":0,"macros":1,"external_links":1,"defined_names":2,"comments":0,"pivot_tables":0},"unopened":[],"bounds":{"document_bytes":16777216,"sheet_cells":100000,"rows_first":2000,"rows_last":500,"rows_between":2000,"halvings":0,"cell_chars":16384,"cell_head_chars":4096},"cells_cut":0,"cells_raw":0,"read":"whole","date_system":"1900"}

{"sheet":"Pots","index":0,"n_rows":34,"n_cols":30,"rows_kept":34,"cut":false,"hidden":false,"merged":[[25,1,25,5],[26,1,26,5],[27,1,27,5],[15,16,15,20],[1,1,1,11],[4,1,11,1],[4,7,11,7],[14,1,21,1],[14,7,21,7],[25,7,25,11],[26,7,26,11]]}
[]
[null,"We Global Football - World Cup 2022 Pots - Follow on Twitter @We_Global"]
[null,null,null,null,null,null,null,null,null,null,null,null,null,null,null,null,null,null,null,null,null,null,null,"Qatar",{"$f":"INDEX('Rankings - ELO Model'!$C$2:$C$212,MATCH($X3,'Rankings - ELO Model'!$B$2:$B$212,0))","v":"AFC"},{"$f":"INDEX('Rankings - ELO Model'!$A$2:$A$212,MATCH($X3,'Rankings - ELO Model'!$B$2:$B$212,0))","v":51},1,{"$f":"INDEX('Rankings - ELO Model'!$D$2:$D$212,MATCH($X3,'Rankings - ELO Model'!$B$2:$B$212,0))","v":1441.4130031106019},null,"United Arab Emirates"]
[null,"Pot","Team","CONFED","Rank","Points",null,"Pot","Team","CONFED","Rank","Points",null,null,null,null,null,null,null,null,null,null,null,"Belgium",{"$f":"INDEX('Rankings - ELO Model'!$C$2:$C$212,MATCH($X4,'Rankings - ELO Model'!$B$2:$B$212,0))","v":"UEFA"},{"$f":"INDEX('Rankings - ELO Model'!$A$2:$A$212,MATCH($X4,'Rankings - ELO Model'!$B$2:$B$212,0))","v":2},{"$f":"RANK($Z4,$Z$4:$Z$31,1)+1","v":3},{"$f":"INDEX('Rankings - ELO Model'!$D$2:$D$212,MATCH($X4,'Rankings - ELO Model'!$B$2:$B$212,0))","v":1827.0039821708599},null,"Australia"]
[null,1,{"$f":"INDEX($X$3:$X$34,MATCH($N5,$AA$3:$AA$34,0))","v":"Qatar"},{"$f":"VLOOKUP(C5,$X$3:$AB$34,2,FALSE)","v":"AFC"},{"$f":"VLOOKUP(C5,$X$3:$AB$34,3,FALSE)","v":51},{"$f":"VLOOKUP(C5,$X$3:$AB$34,5,FALSE)","v":1441.4130031106019},null,3,{"$f":"INDEX($X$3:$X$34,MATCH($O5,$AA$3:$AA$34,0))","v":"Senegal"},{"$f":"VLOOKUP(I5,$X$3:$AB$34,2,FALSE)","v":"CAF"},{"$f":"VLOOKUP(I5,$X$3:$AB$34,3,FALSE)","v":20},{"$f":"VLOOKUP(I5,$X$3:$AB$34,5,FALSE)","v":1584.1595107688142},null,1,17,null,null,null,null,null,null,null,null,"Croatia",{"$f":"INDEX('Rankings - ELO Model'!$C$2:$C$212,MATCH($X5,'Rankings - ELO Model'!$B$2:$B$212,0))","v":"UEFA"},{"$f":"INDEX('Rankings - ELO Model'!$A$2:$A$212,MATCH($X5,'Rankings - ELO Model'!$B$2:$B$212,0))","v":16},16,{"$f":"INDEX('Rankings - ELO Model'!$D$2:$D$212,MATCH($X5,'Rankings - ELO Model'!$B$2:$B$212,0))","v":1621.1105475610261},null,"Peru"]
[null,null,"Brazil","CONMEBOL",1,1832.6891520758379,null,null,"Iran","AFC",21,1564.488687473648,null,2,18,null,null,null,null,null,null,null,null,"Denmark",{"$f":"INDEX('Rankings - ELO Model'!$C$2:$C$212,MATCH($X6,'Rankings - ELO Model'!$B$2:$B$212,0))","v":"UEFA"},{"$f":"INDEX('Rankings - ELO Model'!$A$2:$A$212,MATCH($X6,'Rankings - ELO Model'!$B$2:$B$212,0))","v":11},11,{"$f":"INDEX('Rankings - ELO Model'!$D$2:$D$212,MATCH($X6,'Rankings - ELO Model'!$B$2:$B$212,0))","v":1653.6013353936191}]
[null,null,"Belgium","UEFA",2,1827.0039821708599,null,null,"Japan","AFC",23,1553.4438720239193,null,3,19,null,null,null,null,null,null,null,null,"England",{"$f":"INDEX('Rankings - ELO Model'!$C$2:$C$212,MATCH($X7,'Rankings - ELO Model'!$B$2:$B$212,0))","v":"UEFA"},{"$f":"INDEX('Rankings - ELO Model'!$A$2:$A$212,MATCH($X7,'Rankings - ELO Model'!$B$2:$B$212,0))","v":5},6,{"$f":"INDEX('Rankings - ELO Model'!$D$2:$D$212,MATCH($X7,'Rankings - ELO Model'!$B$2:$B$212,0))","v":1761.7115328290374},null,"Costa Rica"]
[null,null,"France","UEFA",3,1789.8479617675655,null,null,"Morocco","CAF",24,1551.8817268148878,null,4,20,null,null,null,null,null,null,null,null,"France",{"$f":"INDEX('Rankings - ELO Model'!$C$2:$C$212,MATCH($X8,'Rankings - ELO Model'!$B$2:$B$212,0))","v":"UEFA"},{"$f":"INDEX('Rankings - ELO Model'!$A$2:$A$212,MATCH($X8,'Rankings - ELO Model'!$B$2:$B$212,0))","v":3},4,{"$f":"INDEX('Rankings - ELO Model'!$D$2:$D$212,MATCH($X8,'Rankings - ELO Model'!$B$2:$B$212,0))","v":1789.8479617675655},null,"New Zealand"]
[null,null,"Argentina","CONMEBOL",4,1765.132502118413,null,null,"Serbia","UEFA",25,1547.5258407893036,null,5,21,null,null,null,null,null,null,null,null,"Germany",{"$f":"INDEX('Rankings - ELO Model'!$C$2:$C$212,MATCH($X9,'Rankings - ELO Model'!$B$2:$B$212,0))","v":"UEFA"},{"$f":"INDEX('Rankings - ELO Model'!$A$2:$A$212,MATCH($X9,'Rankings - ELO Model'!$B$2:$B$212,0))","v":12},12,{"$f":"INDEX('Rankings - ELO Model'!$D$2:$D$212,MATCH($X9,'Rankings - ELO Model'!$B$2:$B$212,0))","v":1650.5347747884261}]
[null,null,"England","UEFA",5,1761.7115328290374,null,null,"Poland","UEFA",26,1544.2036446717518,null,6,22,null,null,null,null,null,null,null,null,"Netherlands",{"$f":"INDEX('Rankings - ELO Model'!$C$2:$C$212,MATCH($X10,'Rankings - ELO Model'!$B$2:$B$212,0))","v":"UEFA"},{"$f":"INDEX('Rankings - ELO Model'!$A$2:$A$212,MATCH($X10,'Rankings - ELO Model'!$B$2:$B$212,0))","v":10},10,{"$f":"INDEX('Rankings - ELO Model'!$D$2:$D$212,MATCH($X10,'Rankings - ELO Model'!$B$2:$B$212,0))","v":1658.6559820589748},null,"Wales"]
{"$rows_left_out":25}
{"sheet":"Draw","index":1,"n_rows":49,"n_cols":48,"rows_kept":49,"cut":false,"hidden":false,"merged":[[1,1,1,19],[1,26,1,36],[4,26,12,26],[4,33,12,33],[26,26,35,26],[26,33,30,33],[15,26,23,26],[15,33,23,33],[3,11,3,14],[3,16,3,19],[10,1,10,4],[10,6,10,9],[10,11,10,14],[10,16,10,19],[3,1,3,4],[3,6,3,9]]}
[]
[null,"We Global Football - World Cup 2022 Draw Simulator - Follow on Twitter @We_Global",null,null,null,null,null,null,null,null,null,null,null,null,null,null,null,null,null,null,null,null,null,null,null,null,"We Global Football - UEFA World Cup Qualifying Pots"]
[]
[null,"Group A",null,null,null,null,"Group B",null,null,null,null,"Group C",null,null,null,null,"Group D",null,null,null,null,null,null,null,null,null,"Pot","Team","Rank","Points",null,null,null,"Pot","Team","Rank","Points"]
[null,"Team","CONFED","Rank","Points",null,"Team","CONFED","Rank","Points",null,"Team","CONFED","Rank","Points",null,"Team","CONFED","Rank","Points",null,null,null,null,null,null,1,{"$f":"Pots!C5","v":"Qatar"},{"$f":"Pots!E5","v":51},{"$f":"Pots!F5","v":1441.4130031106019},{"$f":"RAND()","v":0.72618311142429981},1,null,3,{"$f":"Pots!I5","v":"Senegal"},{"$f":"Pots!K5","v":20},{"$f":"Pots!L5","v":1584.1595107688142},{"$f":"RAND()","v":0.78097888828249884},{"$f":"RANK(AL5,AL5:AL13)","v":3},null,null,"UEFA","AFC","CAF","CONCACAF","CONMEBOL","OFC"]
[null,{"$f":"INDEX($AB$5:$AB$13,MATCH(B20,$AF$5:$AF$13,0))","v":"Qatar"},{"$f":"VLOOKUP(B6,'Rankings - ELO Model'!$B$2:$E$212,2,FALSE)","v":"AFC"},{"$f":"INDEX('Rankings - ELO Model'!$A$2:$A$212,MATCH(B6,'Rankings - ELO Model'!$B$2:$B$212,0))","v":51},{"$f":"INDEX('Rankings - ELO Model'!$D$2:$D$212,MATCH(B6,'Rankings - ELO Model'!$B$2:$B$212,0))","v":1441.4130031106019},null,{"$f":"INDEX($AB$5:$AB$13,MATCH(G20,$AF$5:$AF$13,0))","v":"Portugal"},{"$f":"VLOOKUP(G6,'Rankings - ELO Model'!$B$2:$E$212,2,FALSE)","v":"UEFA"},{"$f":"INDEX('Rankings - ELO Model'!$A$2:$A$212,MATCH(G6,'Rankings - ELO Model'!$B$2:$B$212,0))","v":8},{"$f":"INDEX('Rankings - ELO Model'!$D$2:$D$212,MATCH(G6,'Rankings - ELO Model'!$B$2:$B$212,0))","v":1674.7824268576876},null,{"$f":"INDEX($AB$5:$AB$13,MATCH(L20,$AF$5:$AF$13,0))","v":"Belgium"},{"$f":"VLOOKUP(L6,'Rankings - ELO Model'!$B$2:$E$212,2,FALSE)","v":"UEFA"},{"$f":"INDEX('Rankings - ELO Model'!$A$2:$A$212,MATCH(L6,'Rankings - ELO Model'!$B$2:$B$212,0))","v":2},{"$f":"INDEX('Rankings - ELO Model'!$D$2:$D$212,MATCH(L6,'Rankings - ELO Model'!$B$2:$B$212,0))","v":1827.0039821708599},null,{"$f":"INDEX($AB$5:$AB$13,MATCH(Q20,$AF$5:$AF$13,0))","v":"Argentina"},{"$f":"VLOOKUP(Q6,'Rankings - ELO Model'!$B$2:$E$212,2,FALSE)","v":"CONMEBOL"},{"$f":"INDEX('Rankings - ELO Model'!$A$2:$A$212,MATCH(Q6,'Rankings - ELO Model'!$B$2:$B$212,0))","v":4},{"$f":"INDEX('Rankings - ELO Model'!$D$2:$D$212,MATCH(Q6,'Rankings - ELO Model'!$B$2:$B$212,0))","v":1765.132502118413},null,null,null,null,null,null,null,{"$f":"Pots!C6","v":"Brazil"},{"$f":"Pots!E6","v":1},{"$f":"Pots!F6","v":1832.6891520758379},{"$f":"RAND()","v":0.41416182907557242},{"$f":"RANK(AE6,AE6:AE13)+1","v":7},null,null,{"$f":"Pots!I6","v":"Iran"},{"$f":"Pots!K6","v":21},{"$f":"Pots!L6","v":1564.488687473648},{"$f":"RAND()","v":4.2649184060549183E-3},{"$f":"RANK(AL6,AL5:AL13)","v":8},null,null,{"$f":"COUNTIF($C$6:$C$9,AP$5)","v":1},2,0,1,0,0]
[null,{"$f":"INDEX($AB$16:$AB$24,MATCH(B21,$AF$16:$AF$24,0))","v":"Netherlands"},{"$f":"VLOOKUP(B7,'Rankings - ELO Model'!$B$2:$E$212,2,FALSE)","v":"UEFA"},{"$f":"INDEX('Rankings - ELO Model'!$A$2:$A$212,MATCH(B7,'Rankings - ELO Model'!$B$2:$B$212,0))","v":10},{"$f":"INDEX('Rankings - ELO Model'!$D$2:$D$212,MATCH(B7,'Rankings - ELO Model'!$B$2:$B$212,0))","v":1658.6559820589748},null,{"$f":"INDEX($AB$16:$AB$24,MATCH(G21,$AF$16:$AF$24,0))","v":"Denmark"},{"$f":"VLOOKUP(G7,'Rankings - ELO Model'!$B$2:$E$212,2,FALSE)","v":"UEFA"},{"$f":"INDEX('Rankings - ELO Model'!$A$2:$A$212,MATCH(G7,'Rankings - ELO Model'!$B$2:$B$212,0))","v":11},{"$f":"INDEX('Rankings - ELO Model'!$D$2:$D$212,MATCH(G7,'Rankings - ELO Model'!$B$2:$B$212,0))","v":1653.6013353936191},null,{"$f":"INDEX($AB$16:$AB$24,MATCH(L21,$AF$16:$AF$24,0))","v":"Mexico"},{"$f":"VLOOKUP(L7,'Rankings - ELO Model'!$B$2:$E$212,2,FALSE)","v":"CONCACAF"},{"$f":"INDEX('Rankings - ELO Model'!$A$2:$A$212,MATCH(L7,'Rankings - ELO Model'!$B$2:$B$212,0))","v":9},{"$f":"INDEX('Rankings - ELO Model'!$D$2:$D$212,MATCH(L7,'Rankings - ELO Model'!$B$2:$B$212,0))","v":1658.8226051217907},null,{"$f":"INDEX($AB$16:$AB$24,MATCH(Q21,$AF$16:$AF$24,0))","v":"Switzerland"},{"$f":"VLOOKUP(Q7,'Rankings - ELO Model'!$B$2:$E$212,2,FALSE)","v":"UEFA"},{"$f":"INDEX('Rankings - ELO Model'!$A$2:$A$212,MATCH(Q7,'Rankings - ELO Model'!$B$2:$B$212,0))","v":14},{"$f":"INDEX('Rankings - ELO Model'!$D$2:$D$212,MATCH(Q7,'Rankings - ELO Model'!$B$2:$B$212,0))","v":1635.3151229415876},null,null,null,null,null,null,null,{"$f":"Pots!C7","v":"Belgium"},{"$f":"Pots!E7","v":2},{"$f":"Pots!F7","v":1827.0039821708599},0.81639462555258568,{"$f":"RANK(AE7,AE6:AE13)+1","v":3},null,null,{"$f":"Pots!I7","v":"Japan"},{"$f":"Pots!K7","v":23},{"$f":"Pots!L7","v":1553.4438720239193},0.81276652854048292,{"$f":"RANK(AL7,AL5:AL13)","v":1},null,null,{"$f":"COUNTIF($H$6:$H$9,AP$5)","v":2},0,2,0,0,0]
[null,{"$f":"INDEX($AI$5:$AI$14,MATCH(B22,$AM$5:$AM$14,0))","v":"Japan"},{"$f":"VLOOKUP(B8,'Rankings - ELO Model'!$B$2:$E$212,2,FALSE)","v":"AFC"},{"$f":"INDEX('Rankings - ELO Model'!$A$2:$A$212,MATCH(B8,'Rankings - ELO Model'!$B$2:$B$212,0))","v":23},{"$f":"INDEX('Rankings - ELO Model'!$D$2:$D$212,MATCH(B8,'Rankings - ELO Model'!$B$2:$B$212,0))","v":1553.4438720239193},null,{"$f":"INDEX($AI$5:$AI$14,MATCH(G22,$AM$5:$AM$14,0))","v":"Morocco"},{"$f":"VLOOKUP(G8,'Rankings - ELO Model'!$B$2:$E$212,2,FALSE)","v":"CAF"},{"$f":"INDEX('Rankings - ELO Model'!$A$2:$A$212,MATCH(G8,'Rankings - ELO Model'!$B$2:$B$212,0))","v":24},{"$f":"INDEX('Rankings - ELO Model'!$D$2:$D$212,MATCH(G8,'Rankings - ELO Model'!$B$2:$B$212,0))","v":1551.8817268148878},null,{"$f":"INDEX($AI$5:$AI$14,MATCH(L22,$AM$5:$AM$14,0))","v":"Senegal"},{"$f":"VLOOKUP(L8,'Rankings - ELO Model'!$B$2:$E$212,2,FALSE)","v":"CAF"},{"$f":"INDEX('Rankings - ELO Model'!$A$2:$A$212,MATCH(L8,'Rankings - ELO Model'!$B$2:$B$212,0))","v":20},{"$f":"INDEX('Rankings - ELO Model'!$D$2:$D$212,MATCH(L8,'Rankings - ELO Model'!$B$2:$B$212,0))","v":1584.1595107688142},null,{"$f":"INDEX($AI$5:$AI$14,MATCH(Q22,$AM$5:$AM$14,0))","v":"Poland"},{"$f":"VLOOKUP(Q8,'Rankings - ELO Model'!$B$2:$E$212,2,FALSE)","v":"UEFA"},{"$f":"INDEX('Rankings - ELO Model'!$A$2:$A$212,MATCH(Q8,'Rankings - ELO Model'!$B$2:$B$212,0))","v":26},{"$f":"INDEX('Rankings - ELO Model'!$D$2:$D$212,MATCH(Q8,'Rankings - ELO Model'!$B$2:$B$212,0))","v":1544.2036446717518},null,null,null,null,null,null,null,{"$f":"Pots!C8","v":"France"},{"$f":"Pots!E8","v":3},{"$f":"Pots!F8","v":1789.8479617675655},0.55864549751558457,{"$f":"RANK(AE8,AE6:AE13)+1","v":5},null,null,{"$f":"Pots!I8","v":"Morocco"},{"$f":"Pots!K8","v":24},{"$f":"Pots!L8","v":1551.8817268148878},0.78137132781857421,{"$f":"RANK(AL8,AL5:AL13)","v":2},null,null,{"$f":"COUNTIF($M$6:$M$9,AP$5)","v":1},1,1,1,0,0]
[null,{"$f":"INDEX($AI$16:$AI$24,MATCH(B23,$AM$16:$AM$24,0))","v":"Costa Rica"},{"$f":"VLOOKUP(B9,'Rankings - ELO Model'!$B$2:$E$212,2,FALSE)","v":"CONCACAF"},{"$f":"INDEX('Rankings - ELO Model'!$A$2:$A$212,MATCH(B9,'Rankings - ELO Model'!$B$2:$B$212,0))","v":31},{"$f":"INDEX('Rankings - ELO Model'!$D$2:$D$212,MATCH(B9,'Rankings - ELO Model'!$B$2:$B$212,0))","v":1503.0945436452032},null,{"$f":"INDEX($AI$16:$AI$24,MATCH(G23,$AM$16:$AM$24,0))","v":"Ghana"},{"$f":"VLOOKUP(G9,'Rankings - ELO Model'!$B$2:$E$212,2,FALSE)","v":"CAF"},{"$f":"INDEX('Rankings - ELO Model'!$A$2:$A$212,MATCH(G9,'Rankings - ELO Model'!$B$2:$B$212,0))","v":60},{"$f":"INDEX('Rankings - ELO Model'!$D$2:$D$212,MATCH(G9,'Rankings - ELO Model'!$B$2:$B$212,0))","v":1387.3561667888507},null,{"$f":"INDEX($AI$16:$AI$24,MATCH(L23,$AM$16:$AM$24,0))","v":"Saudi Arabia"},{"$f":"VLOOKUP(L9,'Rankings - ELO Model'!$B$2:$E$212,2,FALSE)","v":"AFC"},{"$f":"INDEX('Rankings - ELO Model'!$A$2:$A$212,MATCH(L9,'Rankings - ELO Model'!$B$2:$B$212,0))","v":49},{"$f":"INDEX('Rankings - ELO Model'!$D$2:$D$212,MATCH(L9,'Rankings - ELO Model'!$B$2:$B$212,0))","v":1444.6851080375313},null,{"$f":"INDEX($AI$16:$AI$24,MATCH(Q23,$AM$16:$AM$24,0))","v":"Canada"},{"$f":"VLOOKUP(Q9,'Rankings - ELO Model'!$B$2:$E$212,2,FALSE)","v":"CONCACAF"},{"$f":"INDEX('Rankings - ELO Model'!$A$2:$A$212,MATCH(Q9,'Rankings - ELO Model'!$B$2:$B$212,0))","v":38},{"$f":"INDEX('Rankings - ELO Model'!$D$2:$D$212,MATCH(Q9,'Rankings - ELO Model'!$B$2:$B$212,0))","v":1478.9992909638945},null,null,null,null,null,null,null,{"$f":"Pots!C9","v":"Argentina"},{"$f":"Pots!E9","v":4},{"$f":"Pots!F9","v":1765.132502118413},0.62936550551021675,{"$f":"RANK(AE9,AE6:AE13)+1","v":4},null,null,{"$f":"Pots!I9","v":"Serbia"},{"$f":"Pots!K9","v":25},{"$f":"Pots!L9","v":1547.5258407893036},0.4600872766693187,{"$f":"RANK(AL9,AL5:AL13)","v":5},null,null,{"$f":"COUNTIF($R$6:$R$9,AP$5)","v":2},0,0,1,1,0]
[null,null,null,null,null,null,null,null,null,null,null,null,null,null,null,null,null,null,null,null,null,null,null,null,null,null,null,{"$f":"Pots!C10","v":"England"},{"$f":"Pots!E10","v":5},{"$f":"Pots!F10","v":1761.7115328290374},0.46512891734031359,{"$f":"RANK(AE10,AE6:AE13)+1","v":6},null,null,{"$f":"Pots!I10","v":"Poland"},{"$f":"Pots!K10","v":26},{"$f":"Pots!L10","v":1544.2036446717518},0.50892408108952081,{"$f":"RANK(AL10,AL5:AL13)","v":4},null,null,{"$f":"COUNTIF($C$13:$C$16,AP$5)","v":3},0,0,0,1,0]
{"$rows_left_out":40}
{"sheet":"Rankings - ELO Model","index":2,"n_rows":212,"n_cols":11,"rows_kept":212,"cut":false,"hidden":true,"merged":[]}
["Rank","Team","CONFED","Total Points",null,null,null,null,null,"POINTS","RANK"]
[1,{"$f":"INDEX($H$2:$H$212,MATCH(A2,$K$2:$K$212,0))","v":"Brazil"},{"$f":"VLOOKUP($B2,$H$2:$K$212,2,FALSE)","v":"CONMEBOL"},{"$f":"VLOOKUP($B2,$H$2:$K$212,3,FALSE)","v":1832.6891520758379},{"$f":"$C2&(COUNTIFS($C$2:$C$212,$C2,$A$2:$A$212,\"<\"&$A2)+1)","v":"CONMEBOL1"},null,null,"Brazil","CONMEBOL",1832.6891520758379,{"$f":"RANK(J2,$J$2:$J$212)","v":1}]
[2,{"$f":"INDEX($H$2:$H$212,MATCH(A3,$K$2:$K$212,0))","v":"Belgium"},{"$f":"VLOOKUP($B3,$H$2:$K$212,2,FALSE)","v":"UEFA"},{"$f":"VLOOKUP($B3,$H$2:$K$212,3,FALSE)","v":1827.0039821708599},{"$f":"$C3&(COUNTIFS($C$2:$C$212,$C3,$A$2:$A$212,\"<\"&$A3)+1)","v":"UEFA1"},null,null,"Belgium","UEFA",1827.0039821708599,{"$f":"RANK(J3,$J$2:$J$212)","v":2}]
[3,"France","UEFA",1789.8479617675655,"UEFA2",null,null,"France","UEFA",1789.8479617675655,3]
[4,"Argentina","CONMEBOL",1765.132502118413,"CONMEBOL2",null,null,"Argentina","CONMEBOL",1765.132502118413,4]
[5,"England","UEFA",1761.7115328290374,"UEFA3",null,null,"England","UEFA",1761.7115328290374,5]
[6,"Italy","UEFA",1723.3055778975702,"UEFA4",null,null,"Italy","UEFA",1723.3055778975702,6]
[7,"Spain","UEFA",1709.1938942250388,"UEFA5",null,null,"Spain","UEFA",1709.1938942250388,7]
[8,"Portugal","UEFA",1674.7824268576876,"UEFA6",null,null,"Portugal","UEFA",1674.7824268576876,8]
[9,"Mexico","CONCACAF",1658.8226051217907,"CONCACAF1",null,null,"Mexico","CONCACAF",1658.8226051217907,9]
{"$rows_left_out":202}