{"text_format":"1","workbook":"xlsx","n_sheets":3,"sheets":["Pots","Draw","Rankings - ELO Model"],"not_rendered":{"charts":0,"images":0,"macros":1,"external_links":1,"defined_names":2,"comments":0,"pivot_tables":0},"unopened":[],"bounds":{"document_bytes":16777216,"sheet_cells":100000,"rows_first":2000,"rows_last":500,"rows_between":2000,"halvings":0,"cell_chars":16384,"cell_head_chars":4096},"cells_cut":0,"cells_raw":0,"read":"whole","date_system":"1900"}

{"sheet":"Pots","index":0,"n_rows":34,"n_cols":30,"rows_kept":34,"cut":false,"hidden":false,"merged":[[25,1,25,5],[26,1,26,5],[27,1,27,5],[15,16,15,20],[1,1,1,11],[4,1,11,1],[4,7,11,7],[14,1,21,1],[14,7,21,7],[25,7,25,11],[26,7,26,11]]}
[]
[null,"We Global Football - World Cup 2022 Pots - Follow on Twitter @We_Global"]
[null,null,null,null,null,null,null,null,null,null,null,null,null,null,null,null,null,null,null,null,null,null,null,"Qatar",{"$f":"INDEX('Rankings - ELO Model'!$C$2:$C$212,MATCH($X3,'Rankings - ELO Model'!$B$2:$B$212,0))","v":"AFC"},{"$f":"INDEX('Rankings - ELO Model'!$A$2:$A$212,MATCH($X3,'Rankings - ELO Model'!$B$2:$B$212,0))","v":51},1,{"$f":"INDEX('Rankings - ELO Model'!$D$2:$D$212,MATCH($X3,'Rankings - ELO Model'!$B$2:$B$212,0))","v":1441.4130031106019},null,"United Arab Emirates"]
[null,"Pot","Team","CONFED","Rank","Points",null,"Pot","Team","CONFED","Rank","Points",null,null,null,null,null,null,null,null,null,null,null,"Belgium",{"$f":"INDEX('Rankings - ELO Model'!$C$2:$C$212,MATCH($X4,'Rankings - ELO Model'!$B$2:$B$212,0))","v":"UEFA"},{"$f":"INDEX('Rankings - ELO Model'!$A$2:$A$212,MATCH($X4,'Rankings - ELO Model'!$B$2:$B$212,0))","v":2},{"$f":"RANK($Z4,$Z$4:$Z$31,1)+1","v":3},{"$f":"INDEX('Rankings - ELO Model'!$D$2:$D$212,MATCH($X4,'Rankings - ELO Model'!$B$2:$B$212,0))","v":1827.0039821708599},null,"Australia"]
[null,1,{"$f":"INDEX($X$3:$X$34,MATCH($N5,$AA$3:$AA$34,0))","v":"Qatar"},{"$f":"VLOOKUP(C5,$X$3:$AB$34,2,FALSE)","v":"AFC"},{"$f":"VLOOKUP(C5,$X$3:$AB$34,3,FALSE)","v":51},{"$f":"VLOOKUP(C5,$X$3:$AB$34,5,FALSE)","v":1441.4130031106019},null,3,{"$f":"INDEX($X$3:$X$34,MATCH($O5,$AA$3:$AA$34,0))","v":"Senegal"},{"$f":"VLOOKUP(I5,$X$3:$AB$34,2,FALSE)","v":"CAF"},{"$f":"VLOOKUP(I5,$X$3:$AB$34,3,FALSE)","v":20},{"$f":"VLOOKUP(I5,$X$3:$AB$34,5,FALSE)","v":1584.1595107688142},null,1,17,null,null,null,null,null,null,null,null,"Croatia",{"$f":"INDEX('Rankings - ELO Model'!$C$2:$C$212,MATCH($X5,'Rankings - ELO Model'!$B$2:$B$212,0))","v":"UEFA"},{"$f":"INDEX('Rankings - ELO Model'!$A$2:$A$212,MATCH($X5,'Rankings - ELO Model'!$B$2:$B$212,0))","v":16},16,{"$f":"INDEX('Rankings - ELO Model'!$D$2:$D$212,MATCH($X5,'Rankings - ELO Model'!$B$2:$B$212,0))","v":1621.1105475610261},null,"Peru"]
[null,null,"Brazil","CONMEBOL",1,1832.6891520758379,null,null,"Iran","AFC",21,1564.488687473648,null,2,18,null,null,null,null,null,null,null,null,"Denmark",{"$f":"INDEX('Rankings - ELO Model'!$C$2:$C$212,MATCH($X6,'Rankings - ELO Model'!$B$2:$B$212,0))","v":"UEFA"},{"$f":"INDEX('Rankings - ELO Model'!$A$2:$A$212,MATCH($X6,'Rankings - ELO Model'!$B$2:$B$212,0))","v":11},11,{"$f":"INDEX('Rankings - ELO Model'!$D$2:$D$212,MATCH($X6,'Rankings - ELO Model'!$B$2:$B$212,0))","v":1653.6013353936191}]
[null,null,"Belgium","UEFA",2,1827.0039821708599,null,null,"Japan","AFC",23,1553.4438720239193,null,3,19,null,null,null,null,null,null,null,null,"England",{"$f":"INDEX('Rankings - ELO Model'!$C$2:$C$212,MATCH($X7,'Rankings - ELO Model'!$B$2:$B$212,0))","v":"UEFA"},{"$f":"INDEX('Rankings - ELO Model'!$A$2:$A$212,MATCH($X7,'Rankings - ELO Model'!$B$2:$B$212,0))","v":5},6,{"$f":"INDEX('Rankings - ELO Model'!$D$2:$D$212,MATCH($X7,'Rankings - ELO Model'!$B$2:$B$212,0))","v":1761.7115328290374},null,"Costa Rica"]
[null,null,"France","UEFA",3,1789.8479617675655,null,null,"Morocco","CAF",24,1551.8817268148878,null,4,20,null,null,null,null,null,null,null,null,"France",{"$f":"INDEX('Rankings - ELO Model'!$C$2:$C$212,MATCH($X8,'Rankings - ELO Model'!$B$2:$B$212,0))","v":"UEFA"},{"$f":"INDEX('Rankings - ELO Model'!$A$2:$A$212,MATCH($X8,'Rankings - ELO Model'!$B$2:$B$212,0))","v":3},4,{"$f":"INDEX('Rankings - ELO Model'!$D$2:$D$212,MATCH($X8,'Rankings - ELO Model'!$B$2:$B$212,0))","v":1789.8479617675655},null,"New Zealand"]
[null,null,"Argentina","CONMEBOL",4,1765.132502118413,null,null,"Serbia","UEFA",25,1547.5258407893036,null,5,21,null,null,null,null,null,null,null,null,"Germany",{"$f":"INDEX('Rankings - ELO Model'!$C$2:$C$212,MATCH($X9,'Rankings - ELO Model'!$B$2:$B$212,0))","v":"UEFA"},{"$f":"INDEX('Rankings - ELO Model'!$A$2:$A$212,MATCH($X9,'Rankings - ELO Model'!$B$2:$B$212,0))","v":12},12,{"$f":"INDEX('Rankings - ELO Model'!$D$2:$D$212,MATCH($X9,'Rankings - ELO Model'!$B$2:$B$212,0))","v":1650.5347747884261}]
[null,null,"England","UEFA",5,1761.7115328290374,null,null,"Poland","UEFA",26,1544.2036446717518,null,6,22,null,null,null,null,null,null,null,null,"Netherlands",{"$f":"INDEX('Rankings - ELO Model'!$C$2:$C$212,MATCH($X10,'Rankings - ELO Model'!$B$2:$B$212,0))","v":"UEFA"},{"$f":"INDEX('Rankings - ELO Model'!$A$2:$A$212,MATCH($X10,'Rankings - ELO Model'!$B$2:$B$212,0))","v":10},10,{"$f":"INDEX('Rankings - ELO Model'!$D$2:$D$212,MATCH($X10,'Rankings - ELO Model'!$B$2:$B$212,0))","v":1658.6559820589748},null,"Wales"]
[null,null,"Spain","UEFA",7,1709.1938942250388,null,null,"Korea Republic","AFC",29,1519.5380733351255,null,7,23,null,null,null,null,null,null,null,null,"Serbia",{"$f":"INDEX('Rankings - ELO Model'!$C$2:$C$212,MATCH($X11,'Rankings - ELO Model'!$B$2:$B$212,0))","v":"UEFA"},{"$f":"INDEX('Rankings - ELO Model'!$A$2:$A$212,MATCH($X11,'Rankings - ELO Model'!$B$2:$B$212,0))","v":25},21,{"$f":"INDEX('Rankings - ELO Model'!$D$2:$D$212,MATCH($X11,'Rankings - ELO Model'!$B$2:$B$212,0))","v":1547.5258407893036},null,"Scotland"]
[null,null,"Portugal","UEFA",8,1674.7824268576876,null,null,"Tunisia","CAF",{"$f":"VLOOKUP(I12,$X$3:$AB$34,3,FALSE)","v":35},{"$f":"VLOOKUP(I12,$X$3:$AB$34,5,FALSE)","v":1499.8020285246575},null,8,24,null,null,null,null,null,null,null,null,"Spain",{"$f":"INDEX('Rankings - ELO Model'!$C$2:$C$212,MATCH($X12,'Rankings - ELO Model'!$B$2:$B$212,0))","v":"UEFA"},{"$f":"INDEX('Rankings - ELO Model'!$A$2:$A$212,MATCH($X12,'Rankings - ELO Model'!$B$2:$B$212,0))","v":7},7,{"$f":"INDEX('Rankings - ELO Model'!$D$2:$D$212,MATCH($X12,'Rankings - ELO Model'!$B$2:$B$212,0))","v":1709.1938942250388},null,"Ukraine"]
[null,null,null,null,null,null,null,null,null,null,null,null,null,null,null,null,null,null,null,null,null,null,null,"Switzerland",{"$f":"INDEX('Rankings - ELO Model'!$C$2:$C$212,MATCH($X13,'Rankings - ELO Model'!$B$2:$B$212,0))","v":"UEFA"},{"$f":"INDEX('Rankings - ELO Model'!$A$2:$A$212,MATCH($X13,'Rankings - ELO Model'!$B$2:$B$212,0))","v":14},14,{"$f":"INDEX('Rankings - ELO Model'!$D$2:$D$212,MATCH($X13,'Rankings - ELO Model'!$B$2:$B$212,0))","v":1635.3151229415876}]
[null,"Pot","Team","CONFED","Rank","Points",null,"Pot","Team","CONFED","Rank","Points",null,null,null,null,null,null,null,null,null,null,null,"Iran",{"$f":"INDEX('Rankings - ELO Model'!$C$2:$C$212,MATCH($X14,'Rankings - ELO Model'!$B$2:$B$212,0))","v":"AFC"},{"$f":"INDEX('Rankings - ELO Model'!$A$2:$A$212,MATCH($X14,'Rankings - ELO Model'!$B$2:$B$212,0))","v":21},18,{"$f":"INDEX('Rankings - ELO Model'!$D$2:$D$212,MATCH($X14,'Rankings - ELO Model'!$B$2:$B$212,0))","v":1564.488687473648}]
[null,2,{"$f":"INDEX($X$3:$X$34,MATCH($N15,$AA$3:$AA$34,0))","v":"Mexico"},{"$f":"VLOOKUP(C15,$X$3:$AB$34,2,FALSE)","v":"CONCACAF"},{"$f":"VLOOKUP(C15,$X$3:$AB$34,3,FALSE)","v":9},{"$f":"VLOOKUP(C15,$X$3:$AB$34,5,FALSE)","v":1658.8226051217907},null,4,{"$f":"INDEX($X$3:$X$34,MATCH($O15,$AA$3:$AA$34,0))","v":"Cameroon"},{"$f":"VLOOKUP(I15,$X$3:$AB$34,2,FALSE)","v":"CAF"},{"$f":"VLOOKUP(I15,$X$3:$AB$34,3,FALSE)","v":37},{"$f":"VLOOKUP(I15,$X$3:$AB$34,5,FALSE)","v":1480.4849069777697},null,9,25,null,null,null,null,null,null,null,null,"Korea Republic",{"$f":"INDEX('Rankings - ELO Model'!$C$2:$C$212,MATCH($X15,'Rankings - ELO Model'!$B$2:$B$212,0))","v":"AFC"},{"$f":"INDEX('Rankings - ELO Model'!$A$2:$A$212,MATCH($X15,'Rankings - ELO Model'!$B$2:$B$212,0))","v":29},23,{"$f":"INDEX('Rankings - ELO Model'!$D$2:$D$212,MATCH($X15,'Rankings - ELO Model'!$B$2:$B$212,0))","v":1519.5380733351255}]
[null,null,"Netherlands","UEFA",10,1658.6559820589748,null,null,"Canada","CONCACAF",38,1478.9992909638945,null,10,26,null,"Follow us on Twitter @ We_Global",null,null,null,null,null,null,"Saudi Arabia",{"$f":"INDEX('Rankings - ELO Model'!$C$2:$C$212,MATCH($X16,'Rankings - ELO Model'!$B$2:$B$212,0))","v":"AFC"},{"$f":"INDEX('Rankings - ELO Model'!$A$2:$A$212,MATCH($X16,'Rankings - ELO Model'!$B$2:$B$212,0))","v":49},28,{"$f":"INDEX('Rankings - ELO Model'!$D$2:$D$212,MATCH($X16,'Rankings - ELO Model'!$B$2:$B$212,0))","v":1444.6851080375313}]
[null,null,"Denmark","UEFA",11,1653.6013353936191,null,null,"Ecuador","CONMEBOL",46,1452.6347035864524,null,11,27,null,null,null,null,null,null,null,null,"Japan",{"$f":"INDEX('Rankings - ELO Model'!$C$2:$C$212,MATCH($X17,'Rankings - ELO Model'!$B$2:$B$212,0))","v":"AFC"},{"$f":"INDEX('Rankings - ELO Model'!$A$2:$A$212,MATCH($X17,'Rankings - ELO Model'!$B$2:$B$212,0))","v":23},19,{"$f":"INDEX('Rankings - ELO Model'!$D$2:$D$212,MATCH($X17,'Rankings - ELO Model'!$B$2:$B$212,0))","v":1553.4438720239193}]
[null,null,"Germany","UEFA",12,1650.5347747884261,null,null,"Saudi Arabia","AFC",49,1444.6851080375313,null,12,28,null,null,null,null,null,null,null,null,"Cameroon",{"$f":"INDEX('Rankings - ELO Model'!$C$2:$C$212,MATCH($X18,'Rankings - ELO Model'!$B$2:$B$212,0))","v":"CAF"},{"$f":"INDEX('Rankings - ELO Model'!$A$2:$A$212,MATCH($X18,'Rankings - ELO Model'!$B$2:$B$212,0))","v":37},25,{"$f":"INDEX('Rankings - ELO Model'!$D$2:$D$212,MATCH($X18,'Rankings - ELO Model'!$B$2:$B$212,0))","v":1480.4849069777697}]
[null,null,"Uruguay","CONMEBOL",13,1635.7344918311337,null,null,"Ghana","CAF",60,1387.3561667888507,null,13,29,null,null,null,null,null,null,null,null,"Morocco",{"$f":"INDEX('Rankings - ELO Model'!$C$2:$C$212,MATCH($X19,'Rankings - ELO Model'!$B$2:$B$212,0))","v":"CAF"},{"$f":"INDEX('Rankings - ELO Model'!$A$2:$A$212,MATCH($X19,'Rankings - ELO Model'!$B$2:$B$212,0))","v":24},20,{"$f":"INDEX('Rankings - ELO Model'!$D$2:$D$212,MATCH($X19,'Rankings - ELO Model'!$B$2:$B$212,0))","v":1551.8817268148878}]
[null,null,"Switzerland","UEFA",14,1635.3151229415876,null,null,"Wales","UEFA",18,1588.0820096147083,null,14,30,null,null,null,null,null,null,null,null,"Senegal",{"$f":"INDEX('Rankings - ELO Model'!$C$2:$C$212,MATCH($X20,'Rankings - ELO Model'!$B$2:$B$212,0))","v":"CAF"},{"$f":"INDEX('Rankings - ELO Model'!$A$2:$A$212,MATCH($X20,'Rankings - ELO Model'!$B$2:$B$212,0))","v":20},17,{"$f":"INDEX('Rankings - ELO Model'!$D$2:$D$212,MATCH($X20,'Rankings - ELO Model'!$B$2:$B$212,0))","v":1584.1595107688142}]
[null,null,"USA","CONCACAF",15,1633.7153430189483,null,null,"Peru","CONMEBOL",22,1562.3209657312559,null,15,31,null,null,null,null,null,null,null,null,"Ghana",{"$f":"INDEX('Rankings - ELO Model'!$C$2:$C$212,MATCH($X21,'Rankings - ELO Model'!$B$2:$B$212,0))","v":"CAF"},{"$f":"INDEX('Rankings - ELO Model'!$A$2:$A$212,MATCH($X21,'Rankings - ELO Model'!$B$2:$B$212,0))","v":60},29,{"$f":"INDEX('Rankings - ELO Model'!$D$2:$D$212,MATCH($X21,'Rankings - ELO Model'!$B$2:$B$212,0))","v":1387.3561667888507}]
[null,null,"Croatia","UEFA",16,1621.1105475610261,null,null,"Costa Rica","CONCACAF",31,1503.0945436452032,null,16,32,null,null,null,null,null,null,null,null,"Tunisia",{"$f":"INDEX('Rankings - ELO Model'!$C$2:$C$212,MATCH($X22,'Rankings - ELO Model'!$B$2:$B$212,0))","v":"CAF"},{"$f":"INDEX('Rankings - ELO Model'!$A$2:$A$212,MATCH($X22,'Rankings - ELO Model'!$B$2:$B$212,0))","v":35},24,{"$f":"INDEX('Rankings - ELO Model'!$D$2:$D$212,MATCH($X22,'Rankings - ELO Model'!$B$2:$B$212,0))","v":1499.8020285246575}]
[null,null,null,null,null,null,null,null,null,null,null,null,null,null,null,null,null,null,null,null,null,null,null,"Canada",{"$f":"INDEX('Rankings - ELO Model'!$C$2:$C$212,MATCH($X23,'Rankings - ELO Model'!$B$2:$B$212,0))","v":"CONCACAF"},{"$f":"INDEX('Rankings - ELO Model'!$A$2:$A$212,MATCH($X23,'Rankings - ELO Model'!$B$2:$B$212,0))","v":38},26,{"$f":"INDEX('Rankings - ELO Model'!$D$2:$D$212,MATCH($X23,'Rankings - ELO Model'!$B$2:$B$212,0))","v":1478.9992909638945}]
[null,null,null,null,null,null,null,null,null,null,null,null,null,null,null,null,null,null,null,null,null,null,null,"USA",{"$f":"INDEX('Rankings - ELO Model'!$C$2:$C$212,MATCH($X24,'Rankings - ELO Model'!$B$2:$B$212,0))","v":"CONCACAF"},{"$f":"INDEX('Rankings - ELO Model'!$A$2:$A$212,MATCH($X24,'Rankings - ELO Model'!$B$2:$B$212,0))","v":15},15,{"$f":"INDEX('Rankings - ELO Model'!$D$2:$D$212,MATCH($X24,'Rankings - ELO Model'!$B$2:$B$212,0))","v":1633.7153430189483}]
[null,null,null,null,null,null,null,null,null,null,null,null,null,null,null,null,null,null,null,null,null,null,null,"Mexico",{"$f":"INDEX('Rankings - ELO Model'!$C$2:$C$212,MATCH($X25,'Rankings - ELO Model'!$B$2:$B$212,0))","v":"CONCACAF"},{"$f":"INDEX('Rankings - ELO Model'!$A$2:$A$212,MATCH($X25,'Rankings - ELO Model'!$B$2:$B$212,0))","v":9},9,{"$f":"INDEX('Rankings - ELO Model'!$D$2:$D$212,MATCH($X25,'Rankings - ELO Model'!$B$2:$B$212,0))","v":1658.8226051217907}]
[null,"Select Playoff Winners",null,null,null,null,null,"UEFA Path A Playoff Winner",null,null,null,null,null,null,null,null,null,null,null,null,null,null,null,"Poland",{"$f":"INDEX('Rankings - ELO Model'!$C$2:$C$212,MATCH($X26,'Rankings - ELO Model'!$B$2:$B$212,0))","v":"UEFA"},{"$f":"INDEX('Rankings - ELO Model'!$A$2:$A$212,MATCH($X26,'Rankings - ELO Model'!$B$2:$B$212,0))","v":26},22,{"$f":"INDEX('Rankings - ELO Model'!$D$2:$D$212,MATCH($X26,'Rankings - ELO Model'!$B$2:$B$212,0))","v":1544.2036446717518}]
[null,"Peru",null,null,null,null,null,"Wales",null,null,null,null,null,null,null,null,null,null,null,null,null,null,null,"Portugal",{"$f":"INDEX('Rankings - ELO Model'!$C$2:$C$212,MATCH($X27,'Rankings - ELO Model'!$B$2:$B$212,0))","v":"UEFA"},{"$f":"INDEX('Rankings - ELO Model'!$A$2:$A$212,MATCH($X27,'Rankings - ELO Model'!$B$2:$B$212,0))","v":8},8,{"$f":"INDEX('Rankings - ELO Model'!$D$2:$D$212,MATCH($X27,'Rankings - ELO Model'!$B$2:$B$212,0))","v":1674.7824268576876}]
[null,"Costa Rica",null,null,null,null,null,null,null,null,null,null,null,null,null,null,null,null,null,null,null,null,null,"Brazil",{"$f":"INDEX('Rankings - ELO Model'!$C$2:$C$212,MATCH($X28,'Rankings - ELO Model'!$B$2:$B$212,0))","v":"CONMEBOL"},{"$f":"INDEX('Rankings - ELO Model'!$A$2:$A$212,MATCH($X28,'Rankings - ELO Model'!$B$2:$B$212,0))","v":1},2,{"$f":"INDEX('Rankings - ELO Model'!$D$2:$D$212,MATCH($X28,'Rankings - ELO Model'!$B$2:$B$212,0))","v":1832.6891520758379}]
[null,null,null,null,null,null,null,null,null,null,null,null,null,null,null,null,null,null,null,null,null,null,null,"Argentina",{"$f":"INDEX('Rankings - ELO Model'!$C$2:$C$212,MATCH($X29,'Rankings - ELO Model'!$B$2:$B$212,0))","v":"CONMEBOL"},{"$f":"INDEX('Rankings - ELO Model'!$A$2:$A$212,MATCH($X29,'Rankings - ELO Model'!$B$2:$B$212,0))","v":4},5,{"$f":"INDEX('Rankings - ELO Model'!$D$2:$D$212,MATCH($X29,'Rankings - ELO Model'!$B$2:$B$212,0))","v":1765.132502118413}]
[null,"* Select Playoff Winners from Drop-Downs",null,null,null,null,null,null,null,null,null,null,null,null,null,null,null,null,null,null,null,null,null,"Ecuador",{"$f":"INDEX('Rankings - ELO Model'!$C$2:$C$212,MATCH($X30,'Rankings - ELO Model'!$B$2:$B$212,0))","v":"CONMEBOL"},{"$f":"INDEX('Rankings - ELO Model'!$A$2:$A$212,MATCH($X30,'Rankings - ELO Model'!$B$2:$B$212,0))","v":46},27,{"$f":"INDEX('Rankings - ELO Model'!$D$2:$D$212,MATCH($X30,'Rankings - ELO Model'!$B$2:$B$212,0))","v":1452.6347035864524}]
[null,null,null,null,null,null,null,null,null,null,null,null,null,null,null,null,null,null,null,null,null,null,null,"Uruguay",{"$f":"INDEX('Rankings - ELO Model'!$C$2:$C$212,MATCH($X31,'Rankings - ELO Model'!$B$2:$B$212,0))","v":"CONMEBOL"},{"$f":"INDEX('Rankings - ELO Model'!$A$2:$A$212,MATCH($X31,'Rankings - ELO Model'!$B$2:$B$212,0))","v":13},13,{"$f":"INDEX('Rankings - ELO Model'!$D$2:$D$212,MATCH($X31,'Rankings - ELO Model'!$B$2:$B$212,0))","v":1635.7344918311337}]
[null,null,null,null,null,null,null,null,null,null,null,null,null,null,null,null,null,null,null,null,null,null,null,{"$f":"H27","v":"Wales"},{"$f":"INDEX('Rankings - ELO Model'!$C$2:$C$212,MATCH($X32,'Rankings - ELO Model'!$B$2:$B$212,0))","v":"UEFA"},{"$f":"INDEX('Rankings - ELO Model'!$A$2:$A$212,MATCH($X32,'Rankings - ELO Model'!$B$2:$B$212,0))","v":18},30,{"$f":"INDEX('Rankings - ELO Model'!$D$2:$D$212,MATCH($X32,'Rankings - ELO Model'!$B$2:$B$212,0))","v":1588.0820096147083}]
[null,null,null,null,null,null,null,null,null,null,null,null,null,null,null,null,null,null,null,null,null,null,null,{"$f":"B27","v":"Peru"},{"$f":"INDEX('Rankings - ELO Model'!$C$2:$C$212,MATCH($X33,'Rankings - ELO Model'!$B$2:$B$212,0))","v":"CONMEBOL"},{"$f":"INDEX('Rankings - ELO Model'!$A$2:$A$212,MATCH($X33,'Rankings - ELO Model'!$B$2:$B$212,0))","v":22},31,{"$f":"INDEX('Rankings - ELO Model'!$D$2:$D$212,MATCH($X33,'Rankings - ELO Model'!$B$2:$B$212,0))","v":1562.3209657312559}]
[null,null,null,null,null,null,null,null,null,null,null,null,null,null,null,null,null,null,null,null,null,null,null,{"$f":"B28","v":"Costa Rica"},{"$f":"INDEX('Rankings - ELO Model'!$C$2:$C$212,MATCH($X34,'Rankings - ELO Model'!$B$2:$B$212,0))","v":"CONCACAF"},{"$f":"INDEX('Rankings - ELO Model'!$A$2:$A$212,MATCH($X34,'Rankings - ELO Model'!$B$2:$B$212,0))","v":31},32,{"$f":"INDEX('Rankings - ELO Model'!$D$2:$D$212,MATCH($X34,'Rankings - ELO Model'!$B$2:$B$212,0))","v":1503.0945436452032}]

{"sheet":"Draw","index":1,"n_rows":49,"n_cols":48,"rows_kept":49,"cut":false,"hidden":false,"merged":[[1,1,1,19],[1,26,1,36],[4,26,12,26],[4,33,12,33],[26,26,35,26],[26,33,30,33],[15,26,23,26],[15,33,23,33],[3,11,3,14],[3,16,3,19],[10,1,10,4],[10,6,10,9],[10,11,10,14],[10,16,10,19],[3,1,3,4],[3,6,3,9]]}
[]
[null,"We Global Football - World Cup 2022 Draw Simulator - Follow on Twitter @We_Global",null,null,null,null,null,null,null,null,null,null,null,null,null,null,null,null,null,null,null,null,null,null,null,null,"We Global Football - UEFA World Cup Qualifying Pots"]
[]
[null,"Group A",null,null,null,null,"Group B",null,null,null,null,"Group C",null,null,null,null,"Group D",null,null,null,null,null,null,null,null,null,"Pot","Team","Rank","Points",null,null,null,"Pot","Team","Rank","Points"]
[null,"Team","CONFED","Rank","Points",null,"Team","CONFED","Rank","Points",null,"Team","CONFED","Rank","Points",null,"Team","CONFED","Rank","Points",null,null,null,null,null,null,1,{"$f":"Pots!C5","v":"Qatar"},{"$f":"Pots!E5","v":51},{"$f":"Pots!F5","v":1441.4130031106019},{"$f":"RAND()","v":0.72618311142429981},1,null,3,{"$f":"Pots!I5","v":"Senegal"},{"$f":"Pots!K5","v":20},{"$f":"Pots!L5","v":1584.1595107688142},{"$f":"RAND()","v":0.78097888828249884},{"$f":"RANK(AL5,AL5:AL13)","v":3},null,null,"UEFA","AFC","CAF","CONCACAF","CONMEBOL","OFC"]
[null,{"$f":"INDEX($AB$5:$AB$13,MATCH(B20,$AF$5:$AF$13,0))","v":"Qatar"},{"$f":"VLOOKUP(B6,'Rankings - ELO Model'!$B$2:$E$212,2,FALSE)","v":"AFC"},{"$f":"INDEX('Rankings - ELO Model'!$A$2:$A$212,MATCH(B6,'Rankings - ELO Model'!$B$2:$B$212,0))","v":51},{"$f":"INDEX('Rankings - ELO Model'!$D$2:$D$212,MATCH(B6,'Rankings - ELO Model'!$B$2:$B$212,0))","v":1441.4130031106019},null,{"$f":"INDEX($AB$5:$AB$13,MATCH(G20,$AF$5:$AF$13,0))","v":"Portugal"},{"$f":"VLOOKUP(G6,'Rankings - ELO Model'!$B$2:$E$212,2,FALSE)","v":"UEFA"},{"$f":"INDEX('Rankings - ELO Model'!$A$2:$A$212,MATCH(G6,'Rankings - ELO Model'!$B$2:$B$212,0))","v":8},{"$f":"INDEX('Rankings - ELO Model'!$D$2:$D$212,MATCH(G6,'Rankings - ELO Model'!$B$2:$B$212,0))","v":1674.7824268576876},null,{"$f":"INDEX($AB$5:$AB$13,MATCH(L20,$AF$5:$AF$13,0))","v":"Belgium"},{"$f":"VLOOKUP(L6,'Rankings - ELO Model'!$B$2:$E$212,2,FALSE)","v":"UEFA"},{"$f":"INDEX('Rankings - ELO Model'!$A$2:$A$212,MATCH(L6,'Rankings - ELO Model'!$B$2:$B$212,0))","v":2},{"$f":"INDEX('Rankings - ELO Model'!$D$2:$D$212,MATCH(L6,'Rankings - ELO Model'!$B$2:$B$212,0))","v":1827.0039821708599},null,{"$f":"INDEX($AB$5:$AB$13,MATCH(Q20,$AF$5:$AF$13,0))","v":"Argentina"},{"$f":"VLOOKUP(Q6,'Rankings - ELO Model'!$B$2:$E$212,2,FALSE)","v":"CONMEBOL"},{"$f":"INDEX('Rankings - ELO Model'!$A$2:$A$212,MATCH(Q6,'Rankings - ELO Model'!$B$2:$B$212,0))","v":4},{"$f":"INDEX('Rankings - ELO Model'!$D$2:$D$212,MATCH(Q6,'Rankings - ELO Model'!$B$2:$B$212,0))","v":1765.132502118413},null,null,null,null,null,null,null,{"$f":"Pots!C6","v":"Brazil"},{"$f":"Pots!E6","v":1},{"$f":"Pots!F6","v":1832.6891520758379},{"$f":"RAND()","v":0.41416182907557242},{"$f":"RANK(AE6,AE6:AE13)+1","v":7},null,null,{"$f":"Pots!I6","v":"Iran"},{"$f":"Pots!K6","v":21},{"$f":"Pots!L6","v":1564.488687473648},{"$f":"RAND()","v":4.2649184060549183E-3},{"$f":"RANK(AL6,AL5:AL13)","v":8},null,null,{"$f":"COUNTIF($C$6:$C$9,AP$5)","v":1},2,0,1,0,0]
[null,{"$f":"INDEX($AB$16:$AB$24,MATCH(B21,$AF$16:$AF$24,0))","v":"Netherlands"},{"$f":"VLOOKUP(B7,'Rankings - ELO Model'!$B$2:$E$212,2,FALSE)","v":"UEFA"},{"$f":"INDEX('Rankings - ELO Model'!$A$2:$A$212,MATCH(B7,'Rankings - ELO Model'!$B$2:$B$212,0))","v":10},{"$f":"INDEX('Rankings - ELO Model'!$D$2:$D$212,MATCH(B7,'Rankings - ELO Model'!$B$2:$B$212,0))","v":1658.6559820589748},null,{"$f":"INDEX($AB$16:$AB$24,MATCH(G21,$AF$16:$AF$24,0))","v":"Denmark"},{"$f":"VLOOKUP(G7,'Rankings - ELO Model'!$B$2:$E$212,2,FALSE)","v":"UEFA"},{"$f":"INDEX('Rankings - ELO Model'!$A$2:$A$212,MATCH(G7,'Rankings - ELO Model'!$B$2:$B$212,0))","v":11},{"$f":"INDEX('Rankings - ELO Model'!$D$2:$D$212,MATCH(G7,'Rankings - ELO Model'!$B$2:$B$212,0))","v":1653.6013353936191},null,{"$f":"INDEX($AB$16:$AB$24,MATCH(L21,$AF$16:$AF$24,0))","v":"Mexico"},{"$f":"VLOOKUP(L7,'Rankings - ELO Model'!$B$2:$E$212,2,FALSE)","v":"CONCACAF"},{"$f":"INDEX('Rankings - ELO Model'!$A$2:$A$212,MATCH(L7,'Rankings - ELO Model'!$B$2:$B$212,0))","v":9},{"$f":"INDEX('Rankings - ELO Model'!$D$2:$D$212,MATCH(L7,'Rankings - ELO Model'!$B$2:$B$212,0))","v":1658.8226051217907},null,{"$f":"INDEX($AB$16:$AB$24,MATCH(Q21,$AF$16:$AF$24,0))","v":"Switzerland"},{"$f":"VLOOKUP(Q7,'Rankings - ELO Model'!$B$2:$E$212,2,FALSE)","v":"UEFA"},{"$f":"INDEX('Rankings - ELO Model'!$A$2:$A$212,MATCH(Q7,'Rankings - ELO Model'!$B$2:$B$212,0))","v":14},{"$f":"INDEX('Rankings - ELO Model'!$D$2:$D$212,MATCH(Q7,'Rankings - ELO Model'!$B$2:$B$212,0))","v":1635.3151229415876},null,null,null,null,null,null,null,{"$f":"Pots!C7","v":"Belgium"},{"$f":"Pots!E7","v":2},{"$f":"Pots!F7","v":1827.0039821708599},0.81639462555258568,{"$f":"RANK(AE7,AE6:AE13)+1","v":3},null,null,{"$f":"Pots!I7","v":"Japan"},{"$f":"Pots!K7","v":23},{"$f":"Pots!L7","v":1553.4438720239193},0.81276652854048292,{"$f":"RANK(AL7,AL5:AL13)","v":1},null,null,{"$f":"COUNTIF($H$6:$H$9,AP$5)","v":2},0,2,0,0,0]
[null,{"$f":"INDEX($AI$5:$AI$14,MATCH(B22,$AM$5:$AM$14,0))","v":"Japan"},{"$f":"VLOOKUP(B8,'Rankings - ELO Model'!$B$2:$E$212,2,FALSE)","v":"AFC"},{"$f":"INDEX('Rankings - ELO Model'!$A$2:$A$212,MATCH(B8,'Rankings - ELO Model'!$B$2:$B$212,0))","v":23},{"$f":"INDEX('Rankings - ELO Model'!$D$2:$D$212,MATCH(B8,'Rankings - ELO Model'!$B$2:$B$212,0))","v":1553.4438720239193},null,{"$f":"INDEX($AI$5:$AI$14,MATCH(G22,$AM$5:$AM$14,0))","v":"Morocco"},{"$f":"VLOOKUP(G8,'Rankings - ELO Model'!$B$2:$E$212,2,FALSE)","v":"CAF"},{"$f":"INDEX('Rankings - ELO Model'!$A$2:$A$212,MATCH(G8,'Rankings - ELO Model'!$B$2:$B$212,0))","v":24},{"$f":"INDEX('Rankings - ELO Model'!$D$2:$D$212,MATCH(G8,'Rankings - ELO Model'!$B$2:$B$212,0))","v":1551.8817268148878},null,{"$f":"INDEX($AI$5:$AI$14,MATCH(L22,$AM$5:$AM$14,0))","v":"Senegal"},{"$f":"VLOOKUP(L8,'Rankings - ELO Model'!$B$2:$E$212,2,FALSE)","v":"CAF"},{"$f":"INDEX('Rankings - ELO Model'!$A$2:$A$212,MATCH(L8,'Rankings - ELO Model'!$B$2:$B$212,0))","v":20},{"$f":"INDEX('Rankings - ELO Model'!$D$2:$D$212,MATCH(L8,'Rankings - ELO Model'!$B$2:$B$212,0))","v":1584.1595107688142},null,{"$f":"INDEX($AI$5:$AI$14,MATCH(Q22,$AM$5:$AM$14,0))","v":"Poland"},{"$f":"VLOOKUP(Q8,'Rankings - ELO Model'!$B$2:$E$212,2,FALSE)","v":"UEFA"},{"$f":"INDEX('Rankings - ELO Model'!$A$2:$A$212,MATCH(Q8,'Rankings - ELO Model'!$B$2:$B$212,0))","v":26},{"$f":"INDEX('Rankings - ELO Model'!$D$2:$D$212,MATCH(Q8,'Rankings - ELO Model'!$B$2:$B$212,0))","v":1544.2036446717518},null,null,null,null,null,null,null,{"$f":"Pots!C8","v":"France"},{"$f":"Pots!E8","v":3},{"$f":"Pots!F8","v":1789.8479617675655},0.55864549751558457,{"$f":"RANK(AE8,AE6:AE13)+1","v":5},null,null,{"$f":"Pots!I8","v":"Morocco"},{"$f":"Pots!K8","v":24},{"$f":"Pots!L8","v":1551.8817268148878},0.78137132781857421,{"$f":"RANK(AL8,AL5:AL13)","v":2},null,null,{"$f":"COUNTIF($M$6:$M$9,AP$5)","v":1},1,1,1,0,0]
[null,{"$f":"INDEX($AI$16:$AI$24,MATCH(B23,$AM$16:$AM$24,0))","v":"Costa Rica"},{"$f":"VLOOKUP(B9,'Rankings - ELO Model'!$B$2:$E$212,2,FALSE)","v":"CONCACAF"},{"$f":"INDEX('Rankings - ELO Model'!$A$2:$A$212,MATCH(B9,'Rankings - ELO Model'!$B$2:$B$212,0))","v":31},{"$f":"INDEX('Rankings - ELO Model'!$D$2:$D$212,MATCH(B9,'Rankings - ELO Model'!$B$2:$B$212,0))","v":1503.0945436452032},null,{"$f":"INDEX($AI$16:$AI$24,MATCH(G23,$AM$16:$AM$24,0))","v":"Ghana"},{"$f":"VLOOKUP(G9,'Rankings - ELO Model'!$B$2:$E$212,2,FALSE)","v":"CAF"},{"$f":"INDEX('Rankings - ELO Model'!$A$2:$A$212,MATCH(G9,'Rankings - ELO Model'!$B$2:$B$212,0))","v":60},{"$f":"INDEX('Rankings - ELO Model'!$D$2:$D$212,MATCH(G9,'Rankings - ELO Model'!$B$2:$B$212,0))","v":1387.3561667888507},null,{"$f":"INDEX($AI$16:$AI$24,MATCH(L23,$AM$16:$AM$24,0))","v":"Saudi Arabia"},{"$f":"VLOOKUP(L9,'Rankings - ELO Model'!$B$2:$E$212,2,FALSE)","v":"AFC"},{"$f":"INDEX('Rankings - ELO Model'!$A$2:$A$212,MATCH(L9,'Rankings - ELO Model'!$B$2:$B$212,0))","v":49},{"$f":"INDEX('Rankings - ELO Model'!$D$2:$D$212,MATCH(L9,'Rankings - ELO Model'!$B$2:$B$212,0))","v":1444.6851080375313},null,{"$f":"INDEX($AI$16:$AI$24,MATCH(Q23,$AM$16:$AM$24,0))","v":"Canada"},{"$f":"VLOOKUP(Q9,'Rankings - ELO Model'!$B$2:$E$212,2,FALSE)","v":"CONCACAF"},{"$f":"INDEX('Rankings - ELO Model'!$A$2:$A$212,MATCH(Q9,'Rankings - ELO Model'!$B$2:$B$212,0))","v":38},{"$f":"INDEX('Rankings - ELO Model'!$D$2:$D$212,MATCH(Q9,'Rankings - ELO Model'!$B$2:$B$212,0))","v":1478.9992909638945},null,null,null,null,null,null,null,{"$f":"Pots!C9","v":"Argentina"},{"$f":"Pots!E9","v":4},{"$f":"Pots!F9","v":1765.132502118413},0.62936550551021675,{"$f":"RANK(AE9,AE6:AE13)+1","v":4},null,null,{"$f":"Pots!I9","v":"Serbia"},{"$f":"Pots!K9","v":25},{"$f":"Pots!L9","v":1547.5258407893036},0.4600872766693187,{"$f":"RANK(AL9,AL5:AL13)","v":5},null,null,{"$f":"COUNTIF($R$6:$R$9,AP$5)","v":2},0,0,1,1,0]
[null,null,null,null,null,null,null,null,null,null,null,null,null,null,null,null,null,null,null,null,null,null,null,null,null,null,null,{"$f":"Pots!C10","v":"England"},{"$f":"Pots!E10","v":5},{"$f":"Pots!F10","v":1761.7115328290374},0.46512891734031359,{"$f":"RANK(AE10,AE6:AE13)+1","v":6},null,null,{"$f":"Pots!I10","v":"Poland"},{"$f":"Pots!K10","v":26},{"$f":"Pots!L10","v":1544.2036446717518},0.50892408108952081,{"$f":"RANK(AL10,AL5:AL13)","v":4},null,null,{"$f":"COUNTIF($C$13:$C$16,AP$5)","v":3},0,0,0,1,0]
[null,"Group E",null,null,null,null,"Group F",null,null,null,null,"Group G",null,null,null,null,"Group H",null,null,null,null,null,null,null,null,null,null,{"$f":"Pots!C11","v":"Spain"},{"$f":"Pots!E11","v":7},{"$f":"Pots!F11","v":1709.1938942250388},0.15157686128124337,{"$f":"RANK(AE11,AE6:AE13)+1","v":8},null,null,{"$f":"Pots!I11","v":"Korea Republic"},{"$f":"Pots!K11","v":29},{"$f":"Pots!L11","v":1519.5380733351255},4.5803020534338379E-2,{"$f":"RANK(AL11,AL5:AL13)","v":7},null,null,{"$f":"COUNTIF($H$13:$H$16,AP$5)","v":1},0,2,1,0,0]
[null,"Team","CONFED","Rank","Points",null,"Team","CONFED","Rank","Points",null,"Team","CONFED","Rank","Points",null,"Team","CONFED","Rank","Points",null,null,null,null,null,null,null,{"$f":"Pots!C12","v":"Portugal"},{"$f":"Pots!E12","v":8},{"$f":"Pots!F12","v":1674.7824268576876},0.96194402142993818,{"$f":"RANK(AE12,AE6:AE13)+1","v":2},null,null,{"$f":"Pots!I12","v":"Tunisia"},{"$f":"Pots!K12","v":35},{"$f":"Pots!L12","v":1499.8020285246575},8.3616223662241307E-2,{"$f":"RANK(AL12,AL5:AL13)","v":6},null,null,{"$f":"COUNTIF($M$13:$M$16,AP$5)","v":0},1,0,0,3,0]
[null,{"$f":"INDEX($AB$5:$AB$13,MATCH(B28,$AF$5:$AF$13,0))","v":"France"},{"$f":"VLOOKUP(B13,'Rankings - ELO Model'!$B$2:$E$212,2,FALSE)","v":"UEFA"},{"$f":"INDEX('Rankings - ELO Model'!$A$2:$A$212,MATCH(B13,'Rankings - ELO Model'!$B$2:$B$212,0))","v":3},{"$f":"INDEX('Rankings - ELO Model'!$D$2:$D$212,MATCH(B13,'Rankings - ELO Model'!$B$2:$B$212,0))","v":1789.8479617675655},null,{"$f":"INDEX($AB$5:$AB$13,MATCH(G28,$AF$5:$AF$13,0))","v":"England"},{"$f":"VLOOKUP(G13,'Rankings - ELO Model'!$B$2:$E$212,2,FALSE)","v":"UEFA"},{"$f":"INDEX('Rankings - ELO Model'!$A$2:$A$212,MATCH(G13,'Rankings - ELO Model'!$B$2:$B$212,0))","v":5},{"$f":"INDEX('Rankings - ELO Model'!$D$2:$D$212,MATCH(G13,'Rankings - ELO Model'!$B$2:$B$212,0))","v":1761.7115328290374},null,{"$f":"INDEX($AB$5:$AB$13,MATCH(L28,$AF$5:$AF$13,0))","v":"Brazil"},{"$f":"VLOOKUP(L13,'Rankings - ELO Model'!$B$2:$E$212,2,FALSE)","v":"CONMEBOL"},{"$f":"INDEX('Rankings - ELO Model'!$A$2:$A$212,MATCH(L13,'Rankings - ELO Model'!$B$2:$B$212,0))","v":1},{"$f":"INDEX('Rankings - ELO Model'!$D$2:$D$212,MATCH(L13,'Rankings - ELO Model'!$B$2:$B$212,0))","v":1832.6891520758379},null,{"$f":"INDEX($AB$5:$AB$13,MATCH(Q28,$AF$5:$AF$13,0))","v":"Spain"},{"$f":"VLOOKUP(Q13,'Rankings - ELO Model'!$B$2:$E$212,2,FALSE)","v":"UEFA"},{"$f":"INDEX('Rankings - ELO Model'!$A$2:$A$212,MATCH(Q13,'Rankings - ELO Model'!$B$2:$B$212,0))","v":7},{"$f":"INDEX('Rankings - ELO Model'!$D$2:$D$212,MATCH(Q13,'Rankings - ELO Model'!$B$2:$B$212,0))","v":1709.1938942250388},null,null,null,null,null,null,null,null,null,null,null,null,null,null,null,null,null,null,null,null,null,{"$f":"COUNTIF($R$13:$R$16,AP$5)","v":3},1,0,0,0,0]
[null,{"$f":"INDEX($AB$16:$AB$24,MATCH(B29,$AF$16:$AF$24,0))","v":"Germany"},{"$f":"VLOOKUP(B14,'Rankings - ELO Model'!$B$2:$E$212,2,FALSE)","v":"UEFA"},{"$f":"INDEX('Rankings - ELO Model'!$A$2:$A$212,MATCH(B14,'Rankings - ELO Model'!$B$2:$B$212,0))","v":12},{"$f":"INDEX('Rankings - ELO Model'!$D$2:$D$212,MATCH(B14,'Rankings - ELO Model'!$B$2:$B$212,0))","v":1650.5347747884261},null,{"$f":"INDEX($AB$16:$AB$24,MATCH(G29,$AF$16:$AF$24,0))","v":"USA"},{"$f":"VLOOKUP(G14,'Rankings - ELO Model'!$B$2:$E$212,2,FALSE)","v":"CONCACAF"},{"$f":"INDEX('Rankings - ELO Model'!$A$2:$A$212,MATCH(G14,'Rankings - ELO Model'!$B$2:$B$212,0))","v":15},{"$f":"INDEX('Rankings - ELO Model'!$D$2:$D$212,MATCH(G14,'Rankings - ELO Model'!$B$2:$B$212,0))","v":1633.7153430189483},null,{"$f":"INDEX($AB$16:$AB$24,MATCH(L29,$AF$16:$AF$24,0))","v":"Uruguay"},{"$f":"VLOOKUP(L14,'Rankings - ELO Model'!$B$2:$E$212,2,FALSE)","v":"CONMEBOL"},{"$f":"INDEX('Rankings - ELO Model'!$A$2:$A$212,MATCH(L14,'Rankings - ELO Model'!$B$2:$B$212,0))","v":13},{"$f":"INDEX('Rankings - ELO Model'!$D$2:$D$212,MATCH(L14,'Rankings - ELO Model'!$B$2:$B$212,0))","v":1635.7344918311337},null,{"$f":"INDEX($AB$16:$AB$24,MATCH(Q29,$AF$16:$AF$24,0))","v":"Croatia"},{"$f":"VLOOKUP(Q14,'Rankings - ELO Model'!$B$2:$E$212,2,FALSE)","v":"UEFA"},{"$f":"INDEX('Rankings - ELO Model'!$A$2:$A$212,MATCH(Q14,'Rankings - ELO Model'!$B$2:$B$212,0))","v":16},{"$f":"INDEX('Rankings - ELO Model'!$D$2:$D$212,MATCH(Q14,'Rankings - ELO Model'!$B$2:$B$212,0))","v":1621.1105475610261},null,null,null,null,null,null,null,null,null,null,null,null,null,null,null,null,null,null,null,null,null,{"$f":"COUNTIF(AP$6:AP$13,\">2\")","v":2},{"$f":"COUNTIF(AQ$6:AQ$13,\">1\")","v":1},{"$f":"COUNTIF(AR$6:AR$13,\">1\")","v":2},{"$f":"COUNTIF(AS$6:AS$13,\">1\")","v":0},{"$f":"COUNTIF(AT$6:AT$13,\">1\")","v":1},{"$f":"COUNTIF(AU$6:AU$13,\">1\")","v":0},{"$f":"SUM(AP14:AU14)+AQ21+AQ27+COUNTIF(AP6:AP13,0)","v":10}]
[null,{"$f":"INDEX($AI$5:$AI$14,MATCH(B30,$AM$5:$AM$14,0))","v":"Serbia"},{"$f":"VLOOKUP(B15,'Rankings - ELO Model'!$B$2:$E$212,2,FALSE)","v":"UEFA"},{"$f":"INDEX('Rankings - ELO Model'!$A$2:$A$212,MATCH(B15,'Rankings - ELO Model'!$B$2:$B$212,0))","v":25},{"$f":"INDEX('Rankings - ELO Model'!$D$2:$D$212,MATCH(B15,'Rankings - ELO Model'!$B$2:$B$212,0))","v":1547.5258407893036},null,{"$f":"INDEX($AI$5:$AI$14,MATCH(G30,$AM$5:$AM$14,0))","v":"Tunisia"},{"$f":"VLOOKUP(G15,'Rankings - ELO Model'!$B$2:$E$212,2,FALSE)","v":"CAF"},{"$f":"INDEX('Rankings - ELO Model'!$A$2:$A$212,MATCH(G15,'Rankings - ELO Model'!$B$2:$B$212,0))","v":35},{"$f":"INDEX('Rankings - ELO Model'!$D$2:$D$212,MATCH(G15,'Rankings - ELO Model'!$B$2:$B$212,0))","v":1499.8020285246575},null,{"$f":"INDEX($AI$5:$AI$14,MATCH(L30,$AM$5:$AM$14,0))","v":"Korea Republic"},{"$f":"VLOOKUP(L15,'Rankings - ELO Model'!$B$2:$E$212,2,FALSE)","v":"AFC"},{"$f":"INDEX('Rankings - ELO Model'!$A$2:$A$212,MATCH(L15,'Rankings - ELO Model'!$B$2:$B$212,0))","v":29},{"$f":"INDEX('Rankings - ELO Model'!$D$2:$D$212,MATCH(L15,'Rankings - ELO Model'!$B$2:$B$212,0))","v":1519.5380733351255},null,{"$f":"INDEX($AI$5:$AI$14,MATCH(Q30,$AM$5:$AM$14,0))","v":"Iran"},{"$f":"VLOOKUP(Q15,'Rankings - ELO Model'!$B$2:$E$212,2,FALSE)","v":"AFC"},{"$f":"INDEX('Rankings - ELO Model'!$A$2:$A$212,MATCH(Q15,'Rankings - ELO Model'!$B$2:$B$212,0))","v":21},{"$f":"INDEX('Rankings - ELO Model'!$D$2:$D$212,MATCH(Q15,'Rankings - ELO Model'!$B$2:$B$212,0))","v":1564.488687473648},null,null,null,null,null,null,"Pot","Team","Rank","Points",null,null,null,"Pot","Team","Rank","Points"]
[null,{"$f":"INDEX($AI$16:$AI$24,MATCH(B31,$AM$16:$AM$24,0))","v":"Ecuador"},{"$f":"VLOOKUP(B16,'Rankings - ELO Model'!$B$2:$E$212,2,FALSE)","v":"CONMEBOL"},{"$f":"INDEX('Rankings - ELO Model'!$A$2:$A$212,MATCH(B16,'Rankings - ELO Model'!$B$2:$B$212,0))","v":46},{"$f":"INDEX('Rankings - ELO Model'!$D$2:$D$212,MATCH(B16,'Rankings - ELO Model'!$B$2:$B$212,0))","v":1452.6347035864524},null,{"$f":"INDEX($AI$16:$AI$24,MATCH(G31,$AM$16:$AM$24,0))","v":"Cameroon"},{"$f":"VLOOKUP(G16,'Rankings - ELO Model'!$B$2:$E$212,2,FALSE)","v":"CAF"},{"$f":"INDEX('Rankings - ELO Model'!$A$2:$A$212,MATCH(G16,'Rankings - ELO Model'!$B$2:$B$212,0))","v":37},{"$f":"INDEX('Rankings - ELO Model'!$D$2:$D$212,MATCH(G16,'Rankings - ELO Model'!$B$2:$B$212,0))","v":1480.4849069777697},null,{"$f":"INDEX($AI$16:$AI$24,MATCH(L31,$AM$16:$AM$24,0))","v":"Peru"},{"$f":"VLOOKUP(L16,'Rankings - ELO Model'!$B$2:$E$212,2,FALSE)","v":"CONMEBOL"},{"$f":"INDEX('Rankings - ELO Model'!$A$2:$A$212,MATCH(L16,'Rankings - ELO Model'!$B$2:$B$212,0))","v":22},{"$f":"INDEX('Rankings - ELO Model'!$D$2:$D$212,MATCH(L16,'Rankings - ELO Model'!$B$2:$B$212,0))","v":1562.3209657312559},null,{"$f":"INDEX($AI$16:$AI$24,MATCH(Q31,$AM$16:$AM$24,0))","v":"Wales"},{"$f":"VLOOKUP(Q16,'Rankings - ELO Model'!$B$2:$E$212,2,FALSE)","v":"UEFA"},{"$f":"INDEX('Rankings - ELO Model'!$A$2:$A$212,MATCH(Q16,'Rankings - ELO Model'!$B$2:$B$212,0))","v":18},{"$f":"INDEX('Rankings - ELO Model'!$D$2:$D$212,MATCH(Q16,'Rankings - ELO Model'!$B$2:$B$212,0))","v":1588.0820096147083},null,null,null,null,null,null,2,{"$f":"Pots!C15","v":"Mexico"},{"$f":"Pots!E15","v":9},{"$f":"Pots!F15","v":1658.8226051217907},{"$f":"RAND()","v":0.49677420060121358},{"$f":"RANK(AE16,AE16:AE24)","v":3},null,4,{"$f":"Pots!I15","v":"Cameroon"},{"$f":"Pots!K15","v":37},{"$f":"Pots!L15","v":1480.4849069777697},{"$f":"RAND()","v":0.11168523800280183},{"$f":"RANK(AL16,AL16:AL24)","v":6}]
[null,null,null,null,null,null,null,null,null,null,null,null,null,null,null,null,null,null,null,null,null,null,null,null,null,null,null,{"$f":"Pots!C16","v":"Netherlands"},{"$f":"Pots!E16","v":10},{"$f":"Pots!F16","v":1658.6559820589748},{"$f":"RAND()","v":0.89419698003152281},{"$f":"RANK(AE17,AE16:AE24)","v":1},null,null,{"$f":"Pots!I16","v":"Canada"},{"$f":"Pots!K16","v":38},{"$f":"Pots!L16","v":1478.9992909638945},{"$f":"RAND()","v":0.47135096841142465},{"$f":"RANK(AL17,AL16:AL24)","v":4},null,null,"Check Playoffs - CONMEBOL/AFC"]
[null,null,null,null,null,null,null,null,null,null,null,null,null,null,null,null,null,null,null,null,null,null,null,null,null,null,null,{"$f":"Pots!C17","v":"Denmark"},{"$f":"Pots!E17","v":11},{"$f":"Pots!F17","v":1653.6013353936191},0.62427507677925453,{"$f":"RANK(AE18,AE16:AE24)","v":2},null,null,{"$f":"Pots!I17","v":"Ecuador"},{"$f":"Pots!K17","v":46},{"$f":"Pots!L17","v":1452.6347035864524},0.2474876763166366,{"$f":"RANK(AL18,AL16:AL24)","v":5},null,null,{"$f":"INDEX($AB$5:$AB$12,MATCH($AM$22,$AF$5:$AF$12,0))","v":"Brazil"},{"$f":"VLOOKUP(AP18,'Rankings - ELO Model'!$B$2:$E$212,2,FALSE)","v":"CONMEBOL"}]
[null,"* Groups will run until all conditions are satisfied",null,null,null,null,null,null,null,null,null,null,null,null,null,null,null,null,null,null,null,null,null,null,null,null,null,{"$f":"Pots!C18","v":"Germany"},{"$f":"Pots!E18","v":12},{"$f":"Pots!F18","v":1650.5347747884261},0.35555946608159283,{"$f":"RANK(AE19,AE16:AE24)","v":5},null,null,{"$f":"Pots!I18","v":"Saudi Arabia"},{"$f":"Pots!K18","v":49},{"$f":"Pots!L18","v":1444.6851080375313},0.59869080427323962,{"$f":"RANK(AL19,AL16:AL24)","v":3},null,null,{"$f":"INDEX($AB$16:$AB$23,MATCH($AM$22,$AF$16:$AF$23,0))","v":"Uruguay"},{"$f":"VLOOKUP(AP19,'Rankings - ELO Model'!$B$2:$E$212,2,FALSE)","v":"CONMEBOL"}]
[null,1,null,null,null,null,2,null,null,null,null,3,null,null,null,null,4,null,null,null,null,null,null,null,null,null,null,{"$f":"Pots!C19","v":"Uruguay"},{"$f":"Pots!E19","v":13},{"$f":"Pots!F19","v":1635.7344918311337},0.32471461604154472,{"$f":"RANK(AE20,AE16:AE24)","v":7},null,null,{"$f":"Pots!I19","v":"Ghana"},{"$f":"Pots!K19","v":60},{"$f":"Pots!L19","v":1387.3561667888507},0.64396477905694716,{"$f":"RANK(AL20,AL16:AL24)","v":2},null,null,{"$f":"INDEX($AI$5:$AI$12,MATCH($AM$22,$AM$5:$AM$12,0))","v":"Korea Republic"},{"$f":"VLOOKUP(AP20,'Rankings - ELO Model'!$B$2:$E$212,2,FALSE)","v":"AFC"}]
[null,1,null,null,null,null,2,null,null,null,null,3,null,null,null,null,4,null,null,null,null,null,null,null,null,null,null,{"$f":"Pots!C20","v":"Switzerland"},{"$f":"Pots!E20","v":14},{"$f":"Pots!F20","v":1635.3151229415876},0.48349997668948574,{"$f":"RANK(AE21,AE16:AE24)","v":4},null,null,{"$f":"Pots!I20","v":"Wales"},{"$f":"Pots!K20","v":18},{"$f":"Pots!L20","v":1588.0820096147083},8.721545190876645E-3,{"$f":"RANK(AL21,AL16:AL24)","v":8},null,null,null,{"$f":"COUNTIF($AQ$18:$AQ$20,\"AFC\")+COUNTIF($AQ$18:$AQ$20,\"CONMEBOL\")","v":3}]
[null,1,null,null,null,null,2,null,null,null,null,3,null,null,null,null,4,null,null,null,null,null,null,null,null,null,null,{"$f":"Pots!C21","v":"USA"},{"$f":"Pots!E21","v":15},{"$f":"Pots!F21","v":1633.7153430189483},0.35518356177094368,{"$f":"RANK(AE22,AE16:AE24)","v":6},null,null,{"$f":"Pots!I21","v":"Peru"},{"$f":"Pots!K21","v":22},{"$f":"Pots!L21","v":1562.3209657312559},1.6700363263975393E-2,{"$f":"RANK(AL22,AL16:AL24)","v":7}]
[null,1,null,null,null,null,2,null,null,null,null,3,null,null,null,null,4,null,null,null,null,null,null,null,null,null,null,{"$f":"Pots!C22","v":"Croatia"},{"$f":"Pots!E22","v":16},{"$f":"Pots!F22","v":1621.1105475610261},6.8203661024051732E-2,{"$f":"RANK(AE23,AE16:AE24)","v":8},null,null,{"$f":"Pots!I22","v":"Costa Rica"},{"$f":"Pots!K22","v":31},{"$f":"Pots!L22","v":1503.0945436452032},0.85890892239593597,{"$f":"RANK(AL23,AL16:AL24)","v":1},null,null,"Check Playoffs - CONCACAF/OFC"]
[null,1,null,null,null,null,2,null,null,null,null,3,null,null,null,null,4,null,null,null,null,null,null,null,null,null,null,null,null,null,null,null,null,null,null,null,null,null,null,null,null,{"$f":"INDEX($AB$5:$AB$12,MATCH($AM$23,$AF$5:$AF$12,0))","v":"Qatar"},{"$f":"VLOOKUP(AP24,'Rankings - ELO Model'!$B$2:$E$212,2,FALSE)","v":"AFC"}]
[null,null,null,null,null,null,null,null,null,null,null,null,null,null,null,null,null,null,null,null,null,null,null,null,null,null,null,null,null,null,null,null,null,null,null,null,null,null,null,null,null,{"$f":"INDEX($AB$16:$AB$23,MATCH($AM$23,$AF$16:$AF$23,0))","v":"Netherlands"},{"$f":"VLOOKUP(AP25,'Rankings - ELO Model'!$B$2:$E$212,2,FALSE)","v":"UEFA"}]
[null,null,null,null,null,null,null,null,null,null,null,null,null,null,null,null,null,null,null,null,null,null,null,null,null,null,null,null,null,null,null,null,null,null,null,null,null,null,null,null,null,{"$f":"INDEX($AI$5:$AI$12,MATCH($AM$23,$AM$5:$AM$12,0))","v":"Japan"},{"$f":"VLOOKUP(AP26,'Rankings - ELO Model'!$B$2:$E$212,2,FALSE)","v":"AFC"}]
[null,null,null,null,null,null,null,null,null,null,null,null,null,null,null,null,null,null,null,null,null,null,null,null,null,null,null,null,null,null,null,null,null,null,null,null,null,null,null,null,null,null,{"$f":"COUNTIF($AQ$24:$AQ$26,\"CONCACAF\")+COUNTIF($AQ$24:$AQ$26,\"OFC\")","v":0}]
[null,5,null,null,null,null,6,null,null,null,null,7,null,null,null,null,8]
[null,5,null,null,null,null,6,null,null,null,null,7,null,null,null,null,8]
[null,5,null,null,null,null,6,null,null,null,null,7,null,null,null,null,8]
[null,5,null,null,null,null,6,null,null,null,null,7,null,null,null,null,8]
[]
[]
[]
[]
[]
[]
[]
[]
[]
[]
[]
[]
[]
[null,"Notes"]
[null,"Qatar is in position A1"]
[null,"No group can contain more than 2 UEFA teams or more than 1 team from other confederations"]
[null,"Every group must contain at least 1 UEFA team"]
[null,"UEFA and Inter-Confederation Playoff winners go into Pot 4"]

{"sheet":"Rankings - ELO Model","index":2,"n_rows":212,"n_cols":11,"rows_kept":212,"cut":false,"hidden":true,"merged":[]}
["Rank","Team","CONFED","Total Points",null,null,null,null,null,"POINTS","RANK"]
[1,{"$f":"INDEX($H$2:$H$212,MATCH(A2,$K$2:$K$212,0))","v":"Brazil"},{"$f":"VLOOKUP($B2,$H$2:$K$212,2,FALSE)","v":"CONMEBOL"},{"$f":"VLOOKUP($B2,$H$2:$K$212,3,FALSE)","v":1832.6891520758379},{"$f":"$C2&(COUNTIFS($C$2:$C$212,$C2,$A$2:$A$212,\"<\"&$A2)+1)","v":"CONMEBOL1"},null,null,"Brazil","CONMEBOL",1832.6891520758379,{"$f":"RANK(J2,$J$2:$J$212)","v":1}]
[2,{"$f":"INDEX($H$2:$H$212,MATCH(A3,$K$2:$K$212,0))","v":"Belgium"},{"$f":"VLOOKUP($B3,$H$2:$K$212,2,FALSE)","v":"UEFA"},{"$f":"VLOOKUP($B3,$H$2:$K$212,3,FALSE)","v":1827.0039821708599},{"$f":"$C3&(COUNTIFS($C$2:$C$212,$C3,$A$2:$A$212,\"<\"&$A3)+1)","v":"UEFA1"},null,null,"Belgium","UEFA",1827.0039821708599,{"$f":"RANK(J3,$J$2:$J$212)","v":2}]
[3,"France","UEFA",1789.8479617675655,"UEFA2",null,null,"France","UEFA",1789.8479617675655,3]
[4,"Argentina","CONMEBOL",1765.132502118413,"CONMEBOL2",null,null,"Argentina","CONMEBOL",1765.132502118413,4]
[5,"England","UEFA",1761.7115328290374,"UEFA3",null,null,"England","UEFA",1761.7115328290374,5]
[6,"Italy","UEFA",1723.3055778975702,"UEFA4",null,null,"Italy","UEFA",1723.3055778975702,6]
[7,"Spain","UEFA",1709.1938942250388,"UEFA5",null,null,"Spain","UEFA",1709.1938942250388,7]
[8,"Portugal","UEFA",1674.7824268576876,"UEFA6",null,null,"Portugal","UEFA",1674.7824268576876,8]
[9,"Mexico","CONCACAF",1658.8226051217907,"CONCACAF1",null,null,"Mexico","CONCACAF",1658.8226051217907,9]
[10,"Netherlands","UEFA",1658.6559820589748,"UEFA7",null,null,"Netherlands","UEFA",1658.6559820589748,10]
[11,"Denmark","UEFA",1653.6013353936191,"UEFA8",null,null,"Denmark","UEFA",1653.6013353936191,11]
[12,"Germany","UEFA",1650.5347747884261,"UEFA9",null,null,"Germany","UEFA",1650.5347747884261,12]
[13,"Uruguay","CONMEBOL",1635.7344918311337,"CONMEBOL3",null,null,"Uruguay","CONMEBOL",1635.7344918311337,13]
[14,"Switzerland","UEFA",1635.3151229415876,"UEFA10",null,null,"Switzerland","UEFA",1635.3151229415876,14]
[15,"USA","CONCACAF",1633.7153430189483,"CONCACAF2",null,null,"USA","CONCACAF",1633.7153430189483,15]
[16,"Croatia","UEFA",1621.1105475610261,"UEFA11",null,null,"Croatia","UEFA",1621.1105475610261,16]
[17,"Colombia","CONMEBOL",1600.5194043627412,"CONMEBOL4",null,null,"Colombia","CONMEBOL",1600.5194043627412,17]
[18,"Wales","UEFA",1588.0820096147083,"UEFA12",null,null,"Wales","UEFA",1588.0820096147083,18]
[19,"Sweden","UEFA",1584.7687440047994,"UEFA13",null,null,"Sweden","UEFA",1584.7687440047994,19]
[20,"Senegal","CAF",1584.1595107688142,"CAF1",null,null,"Senegal","CAF",1584.1595107688142,20]
[21,"Iran","AFC",1564.488687473648,"AFC1",null,null,"Iran","AFC",1564.488687473648,21]
[22,"Peru","CONMEBOL",1562.3209657312559,"CONMEBOL5",null,null,"Peru","CONMEBOL",1562.3209657312559,22]
[23,"Japan","AFC",1553.4438720239193,"AFC2",null,null,"Japan","AFC",1553.4438720239193,23]
[24,"Morocco","CAF",1551.8817268148878,"CAF2",null,null,"Morocco","CAF",1551.8817268148878,24]
[25,"Serbia","UEFA",1547.5258407893036,"UEFA14",null,null,"Serbia","UEFA",1547.5258407893036,25]
[26,"Poland","UEFA",1544.2036446717518,"UEFA15",null,null,"Poland","UEFA",1544.2036446717518,26]
[27,"Ukraine","UEFA",1535.0763691824195,"UEFA16",null,null,"Ukraine","UEFA",1535.0763691824195,27]
[28,"Chile","CONMEBOL",1526.4015184463176,"CONMEBOL6",null,null,"Chile","CONMEBOL",1526.4015184463176,28]
[29,"Korea Republic","AFC",1519.5380733351255,"AFC3",null,null,"Korea Republic","AFC",1519.5380733351255,29]
[30,"Nigeria","CAF",1504.0067532990038,"CAF3",null,null,"Nigeria","CAF",1504.0067532990038,30]
[31,"Costa Rica","CONCACAF",1503.0945436452032,"CONCACAF3",null,null,"Costa Rica","CONCACAF",1503.0945436452032,31]
[32,"Egypt","CAF",1500.6690972090171,"CAF4",null,null,"Egypt","CAF",1500.6690972090171,32]
[33,"Czech Republic","UEFA",1500.6200374950777,"UEFA17",null,null,"Czech Republic","UEFA",1500.6200374950777,33]
[34,"Austria","UEFA",1500.3745856176627,"UEFA18",null,null,"Austria","UEFA",1500.3745856176627,34]
[35,"Tunisia","CAF",1499.8020285246575,"CAF5",null,null,"Tunisia","CAF",1499.8020285246575,35]
[36,"Russia","UEFA",1493.4221083096159,"UEFA19",null,null,"Russia","UEFA",1493.4221083096159,36]
[37,"Cameroon","CAF",1480.4849069777697,"CAF6",null,null,"Cameroon","CAF",1480.4849069777697,37]
[38,"Canada","CONCACAF",1478.9992909638945,"CONCACAF4",null,null,"Canada","CONCACAF",1478.9992909638945,38]
[39,"Scotland","UEFA",1472.6560594854056,"UEFA20",null,null,"Scotland","UEFA",1472.6560594854056,39]
[40,"Hungary","UEFA",1466.0839267489766,"UEFA21",null,null,"Hungary","UEFA",1466.0839267489766,40]
[41,"Norway","UEFA",1463.49563981097,"UEFA22",null,null,"Norway","UEFA",1463.49563981097,41]
[42,"Australia","AFC",1462.2905088706063,"AFC4",null,null,"Australia","AFC",1462.2905088706063,42]
[43,"Turkey","UEFA",1461.8090301472594,"UEFA23",null,null,"Turkey","UEFA",1461.8090301472594,43]
[44,"Algeria","CAF",1461.2643506288998,"CAF7",null,null,"Algeria","CAF",1461.2643506288998,44]
[45,"Slovakia","UEFA",1454.9843601139562,"UEFA24",null,null,"Slovakia","UEFA",1454.9843601139562,45]
[46,"Ecuador","CONMEBOL",1452.6347035864524,"CONMEBOL7",null,null,"Ecuador","CONMEBOL",1452.6347035864524,46]
[47,"Republic of Ireland","UEFA",1449.4771409054115,"UEFA25",null,null,"Republic of Ireland","UEFA",1449.4771409054115,47]
[48,"Romania","UEFA",1446.5396547712048,"UEFA26",null,null,"Romania","UEFA",1446.5396547712048,48]
[49,"Saudi Arabia","AFC",1444.6851080375313,"AFC5",null,null,"Saudi Arabia","AFC",1444.6851080375313,49]
[50,"Paraguay","CONMEBOL",1443.3020685574056,"CONMEBOL8",null,null,"Paraguay","CONMEBOL",1443.3020685574056,50]
[51,"Qatar","AFC",1441.4130031106019,"AFC6",null,null,"Qatar","AFC",1441.4130031106019,51]
[52,"Mali","CAF",1436.6159475529073,"CAF8",null,null,"Mali","CAF",1436.6159475529073,52]
[53,"Côte d'Ivoire","CAF",1435.2799089602031,"CAF9",null,null,"Côte d'Ivoire","CAF",1435.2799089602031,53]
[54,"Northern Ireland","UEFA",1423.5508410610471,"UEFA27",null,null,"Northern Ireland","UEFA",1423.5508410610471,54]
[55,"Greece","UEFA",1421.4337399274477,"UEFA28",null,null,"Greece","UEFA",1421.4337399274477,55]
[56,"Burkina Faso","CAF",1409.6141555726922,"CAF10",null,null,"Burkina Faso","CAF",1409.6141555726922,56]
[57,"Finland","UEFA",1406.8665923779859,"UEFA29",null,null,"Finland","UEFA",1406.8665923779859,57]
[58,"Venezuela","CONMEBOL",1398.1406944762846,"CONMEBOL9",null,null,"Venezuela","CONMEBOL",1398.1406944762846,58]
[59,"Bosnia-Herzegovina","UEFA",1388.6278841625287,"UEFA30",null,null,"Bosnia-Herzegovina","UEFA",1388.6278841625287,59]
[60,"Ghana","CAF",1387.3561667888507,"CAF11",null,null,"Ghana","CAF",1387.3561667888507,60]
[61,"Panama","CONCACAF",1382.7931969338663,"CONCACAF5",null,null,"Panama","CONCACAF",1382.7931969338663,61]
[62,"North Macedonia","UEFA",1381.0706395272473,"UEFA31",null,null,"North Macedonia","UEFA",1381.0706395272473,62]
[63,"Iceland","UEFA",1380.852602343027,"UEFA32",null,null,"Iceland","UEFA",1380.852602343027,63]
[64,"Jamaica","CONCACAF",1378.7542724461371,"CONCACAF6",null,null,"Jamaica","CONCACAF",1378.7542724461371,64]
[65,"Slovenia","UEFA",1378.228648448048,"UEFA33",null,null,"Slovenia","UEFA",1378.228648448048,65]
[66,{"$f":"INDEX($H$2:$H$212,MATCH(A67,$K$2:$K$212,0))","v":"Albania"},{"$f":"VLOOKUP($B67,$H$2:$K$212,2,FALSE)","v":"UEFA"},{"$f":"VLOOKUP($B67,$H$2:$K$212,3,FALSE)","v":1371.8566078146887},{"$f":"$C67&(COUNTIFS($C$2:$C$212,$C67,$A$2:$A$212,\"<\"&$A67)+1)","v":"UEFA34"},null,null,"Albania","UEFA",1371.8566078146887,{"$f":"RANK(J67,$J$2:$J$212)","v":66}]
[67,"Congo DR","CAF",1365.0692786098687,"CAF12",null,null,"Congo DR","CAF",1365.0692786098687,67]
[68,"United Arab Emirates","AFC",1356.9421948750314,"AFC7",null,null,"United Arab Emirates","AFC",1356.9421948750314,68]
[69,"South Africa","CAF",1356.0099058024496,"CAF13",null,null,"South Africa","CAF",1356.0099058024496,69]
[70,"Montenegro","UEFA",1342.789650587338,"UEFA35",null,null,"Montenegro","UEFA",1342.789650587338,70]
[71,"Cape Verde Islands","CAF",1339.4983308363082,"CAF14",null,null,"Cape Verde Islands","CAF",1339.4983308363082,71]
[72,"Bulgaria","UEFA",1338.7831479901099,"UEFA36",null,null,"Bulgaria","UEFA",1338.7831479901099,72]
[73,"Iraq","AFC",1336.8025302381859,"AFC8",null,null,"Iraq","AFC",1336.8025302381859,73]
[74,"El Salvador","CONCACAF",1331.6529069596386,"CONCACAF7",null,null,"El Salvador","CONCACAF",1331.6529069596386,74]
[75,"Oman","AFC",1324.1611846272815,"AFC9",null,null,"Oman","AFC",1324.1611846272815,75]
[76,"Israel","UEFA",1305.9176596255595,"UEFA37",null,null,"Israel","UEFA",1305.9176596255595,76]
[77,"China PR","AFC",1304.0234686963943,"AFC10",null,null,"China PR","AFC",1304.0234686963943,77]
[78,"Bolivia","CONMEBOL",1298.8067304818285,"CONMEBOL10",null,null,"Bolivia","CONMEBOL",1298.8067304818285,78]
[79,"Curacao","CONCACAF",1298.3868527425082,"CONCACAF8",null,null,"Curacao","CONCACAF",1298.3868527425082,79]
[80,"Guinea","CAF",1293.2073560875426,"CAF15",null,null,"Guinea","CAF",1293.2073560875426,80]
[81,"Gabon","CAF",1290.6475999846521,"CAF16",null,null,"Gabon","CAF",1290.6475999846521,81]
[82,"Honduras","CONCACAF",1289.4721890560868,"CONCACAF9",null,null,"Honduras","CONCACAF",1289.4721890560868,82]
[83,"Benin","CAF",1288.9262773395972,"CAF17",null,null,"Benin","CAF",1288.9262773395972,83]
[84,"Uzbekistan","AFC",1286.550191153106,"AFC11",null,null,"Uzbekistan","AFC",1286.550191153106,84]
[85,"Georgia","UEFA",1276.3111678969972,"UEFA38",null,null,"Georgia","UEFA",1276.3111678969972,85]
[86,"Uganda","CAF",1275.4951236787122,"CAF18",null,null,"Uganda","CAF",1275.4951236787122,86]
[87,"Bahrain","AFC",1265.7603840627978,"AFC12",null,null,"Bahrain","AFC",1265.7603840627978,87]
[88,"Syria","AFC",1264.9786912835511,"AFC13",null,null,"Syria","AFC",1264.9786912835511,88]
[89,"Zambia","CAF",1264.385837787938,"CAF19",null,null,"Zambia","CAF",1264.385837787938,89]
[90,"Haiti","CONCACAF",1261.8598177800766,"CONCACAF10",null,null,"Haiti","CONCACAF",1261.8598177800766,90]
[91,"Jordan","AFC",1259.8352423812457,"AFC14",null,null,"Jordan","AFC",1259.8352423812457,91]
[92,"Armenia","UEFA",1245.1256241179271,"UEFA39",null,null,"Armenia","UEFA",1245.1256241179271,92]
[93,"Belarus","UEFA",1243.2267026587324,"UEFA40",null,null,"Belarus","UEFA",1243.2267026587324,93]
[94,"Luxembourg","UEFA",1229.6047313179515,"UEFA41",null,null,"Luxembourg","UEFA",1229.6047313179515,94]
[95,"Kyrgyzstan","AFC",1218.480753075876,"AFC15",null,null,"Kyrgyzstan","AFC",1218.480753075876,95]
[96,"Vietnam","AFC",1215.3758767566235,"AFC16",null,null,"Vietnam","AFC",1215.3758767566235,96]
[97,"Lebanon","AFC",1211.7071062442926,"AFC17",null,null,"Lebanon","AFC",1211.7071062442926,97]
[98,"Congo","CAF",1211.3855016896887,"CAF20",null,null,"Congo","CAF",1211.3855016896887,98]
[99,"Palestine","AFC",1208.9043754783354,"AFC18",null,null,"Palestine","AFC",1208.9043754783354,99]
[100,"Trinidad and Tobago","CONCACAF",1206.8425479857658,"CONCACAF11",null,null,"Trinidad and Tobago","CONCACAF",1206.8425479857658,100]
[101,"Madagascar","CAF",1205.6134822563117,"CAF21",null,null,"Madagascar","CAF",1205.6134822563117,101]
[102,"Equatorial Guinea","CAF",1203.9323392937247,"CAF22",null,null,"Equatorial Guinea","CAF",1203.9323392937247,102]
[103,"Kenya","CAF",1202.2564636645527,"CAF23",null,null,"Kenya","CAF",1202.2564636645527,103]
[104,"New Zealand","OFC",1198.0198068831644,"OFC1",null,null,"New Zealand","OFC",1198.0198068831644,104]
[105,"Cyprus","UEFA",1186.0901316200454,"UEFA42",null,null,"Cyprus","UEFA",1186.0901316200454,105]
[106,"Sierra Leone","CAF",1177.7806020473988,"CAF24",null,null,"Sierra Leone","CAF",1177.7806020473988,106]
[107,"India","AFC",1174.0406504167242,"AFC19",null,null,"India","AFC",1174.0406504167242,107]
[108,"Kosovo","UEFA",1173.8975140568132,"UEFA43",null,null,"Kosovo","UEFA",1173.8975140568132,108]
[109,"Korea DPR","AFC",1169.9572958083565,"AFC20",null,null,"Korea DPR","AFC",1169.9572958083565,109]
[110,"Estonia","UEFA",1169.0571218778039,"UEFA44",null,null,"Estonia","UEFA",1169.0571218778039,110]
[111,"Thailand","AFC",1167.6754252488922,"AFC21",null,null,"Thailand","AFC",1167.6754252488922,111]
[112,"Namibia","CAF",1162.9262567740684,"CAF25",null,null,"Namibia","CAF",1162.9262567740684,112]
[113,"Mauritania","CAF",1162.4819009932653,"CAF26",null,null,"Mauritania","CAF",1162.4819009932653,113]
[114,"Tajikistan","AFC",1159.4183183016667,"AFC22",null,null,"Tajikistan","AFC",1159.4183183016667,114]
[115,"Guinea-Bissau","CAF",1158.8039180360342,"CAF27",null,null,"Guinea-Bissau","CAF",1158.8039180360342,115]
[116,"Niger","CAF",1153.2306937732885,"CAF28",null,null,"Niger","CAF",1153.2306937732885,116]
[117,"Libya","CAF",1149.6267392814627,"CAF29",null,null,"Libya","CAF",1149.6267392814627,117]
[118,"Guatemala","CONCACAF",1147.849682784155,"CONCACAF12",null,null,"Guatemala","CONCACAF",1147.849682784155,118]
[119,"Mozambique","CAF",1146.0897004395824,"CAF30",null,null,"Mozambique","CAF",1146.0897004395824,119]
[120,"Malawi","CAF",1145.0789154098716,"CAF31",null,null,"Malawi","CAF",1145.0789154098716,120]
[121,"Togo","CAF",1140.0477730075136,"CAF32",null,null,"Togo","CAF",1140.0477730075136,121]
[122,"Zimbabwe","CAF",1138.5554948309875,"CAF33",null,null,"Zimbabwe","CAF",1138.5554948309875,122]
[123,"Gambia","CAF",1138.1934887966308,"CAF34",null,null,"Gambia","CAF",1138.1934887966308,123]
[124,"Angola","CAF",1137.6724642214099,"CAF35",null,null,"Angola","CAF",1137.6724642214099,124]
[125,"Faroe Islands","UEFA",1137.3954297345247,"UEFA45",null,null,"Faroe Islands","UEFA",1137.3954297345247,125]
[126,"Kazakhstan","UEFA",1134.7675249248075,"UEFA46",null,null,"Kazakhstan","UEFA",1134.7675249248075,126]
[127,"Antigua and Barbuda","CONCACAF",1131.0750290859319,"CONCACAF13",null,null,"Antigua and Barbuda","CONCACAF",1131.0750290859319,127]
[128,"Comoros","CAF",1130.7682330166356,"CAF36",null,null,"Comoros","CAF",1130.7682330166356,128]
[129,"Azerbaijan","UEFA",1127.0464271117482,"UEFA47",null,null,"Azerbaijan","UEFA",1127.0464271117482,129]
[130,{"$f":"INDEX($H$2:$H$212,MATCH(A131,$K$2:$K$212,0))","v":"Tanzania"},{"$f":"VLOOKUP($B131,$H$2:$K$212,2,FALSE)","v":"CAF"},{"$f":"VLOOKUP($B131,$H$2:$K$212,3,FALSE)","v":1123.7901471866151},{"$f":"$C131&(COUNTIFS($C$2:$C$212,$C131,$A$2:$A$212,\"<\"&$A131)+1)","v":"CAF37"},null,null,"Tanzania","CAF",1123.7901471866151,{"$f":"RANK(J131,$J$2:$J$212)","v":130}]
[131,"Central African Republic","CAF",1122.0849577623401,"CAF38",null,null,"Central African Republic","CAF",1122.0849577623401,131]
[132,"Sudan","CAF",1118.3996608278658,"CAF39",null,null,"Sudan","CAF",1118.3996608278658,132]
[133,"Philippines","AFC",1117.8918543620184,"AFC23",null,null,"Philippines","AFC",1117.8918543620184,133]
[134,"Turkmenistan","AFC",1117.5967201876226,"AFC24",null,null,"Turkmenistan","AFC",1117.5967201876226,134]
[135,"Latvia","UEFA",1105.016404225225,"UEFA48",null,null,"Latvia","UEFA",1105.016404225225,135]
[136,"Rwanda","CAF",1097.1627877047313,"CAF40",null,null,"Rwanda","CAF",1097.1627877047313,136]
[137,"Lithuania","UEFA",1092.0421409232777,"UEFA49",null,null,"Lithuania","UEFA",1092.0421409232777,137]
[138,"Solomon Islands","OFC",1082.1192030413144,"OFC2",null,null,"Solomon Islands","OFC",1082.1192030413144,138]
[139,"Burundi","CAF",1077.3774578836828,"CAF41",null,null,"Burundi","CAF",1077.3774578836828,139]
[140,"Ethiopia","CAF",1076.6631048645943,"CAF42",null,null,"Ethiopia","CAF",1076.6631048645943,140]
[141,"Suriname","CONCACAF",1073.3854648341062,"CONCACAF14",null,null,"Suriname","CONCACAF",1073.3854648341062,141]
[142,"Eswatini","CAF",1072.8766932138753,"CAF43",null,null,"Eswatini","CAF",1072.8766932138753,142]
[143,"St. Kitts and Nevis","CONCACAF",1072.304702931305,"CONCACAF15",null,null,"St. Kitts and Nevis","CONCACAF",1072.304702931305,143]
[144,"Nicaragua","CONCACAF",1062.2129093218236,"CONCACAF16",null,null,"Nicaragua","CONCACAF",1062.2129093218236,144]
[145,"Kuwait","AFC",1059.9412080750126,"AFC25",null,null,"Kuwait","AFC",1059.9412080750126,145]
[146,"Lesotho","CAF",1059.3049646985778,"CAF44",null,null,"Lesotho","CAF",1059.3049646985778,146]
[147,"Hong Kong","AFC",1053.3914458587819,"AFC26",null,null,"Hong Kong","AFC",1053.3914458587819,147]
[148,"Botswana","CAF",1051.5915802798247,"CAF45",null,null,"Botswana","CAF",1051.5915802798247,148]
[149,"Afghanistan","AFC",1049.7655641406793,"AFC27",null,null,"Afghanistan","AFC",1049.7655641406793,149]
[150,"Liberia","CAF",1046.5790609083417,"CAF46",null,null,"Liberia","CAF",1046.5790609083417,150]
[151,"Yemen","AFC",1046.2577362082661,"AFC28",null,null,"Yemen","AFC",1046.2577362082661,151]
[152,"Myanmar","AFC",1044.5607360825531,"AFC29",null,null,"Myanmar","AFC",1044.5607360825531,152]
[153,"Andorra","UEFA",1040.1344921528721,"UEFA50",null,null,"Andorra","UEFA",1040.1344921528721,153]
[154,"Malaysia","AFC",1035.0584843953188,"AFC30",null,null,"Malaysia","AFC",1035.0584843953188,154]
[155,"Dominican Republic","CONCACAF",1029.4184704077654,"CONCACAF17",null,null,"Dominican Republic","CONCACAF",1029.4184704077654,155]
[156,"Maldives","AFC",1025.5042724752916,"AFC31",null,null,"Maldives","AFC",1025.5042724752916,156]
[157,"Chinese Taipei","AFC",1017.7816811319678,"AFC32",null,null,"Chinese Taipei","AFC",1017.7816811319678,157]
[158,"Singapore","AFC",1012.2725242173524,"AFC33",null,null,"Singapore","AFC",1012.2725242173524,158]
[159,"Papua New Guinea","OFC",1008.3907998210062,"OFC3",null,null,"Papua New Guinea","OFC",1008.3907998210062,159]
[160,"Fiji","OFC",1004.7746442257557,"OFC4",null,null,"Fiji","OFC",1004.7746442257557,160]
[161,"Tahiti","OFC",1003.3691911016944,"OFC5",null,null,"Tahiti","OFC",1003.3691911016944,161]
[162,"Indonesia","AFC",1001.6103888753759,"AFC34",null,null,"Indonesia","AFC",1001.6103888753759,162]
[163,"New Caledonia","OFC",999.98734544764636,"OFC6",null,null,"New Caledonia","OFC",999.98734544764636,163]
[164,"South Sudan","CAF",998.45084619786189,"CAF47",null,null,"South Sudan","CAF",998.45084619786189,164]
[165,"Barbados","CONCACAF",992.84916540811355,"CONCACAF18",null,null,"Barbados","CONCACAF",992.84916540811355,165]
[166,"Bermuda","CONCACAF",982.42640032381507,"CONCACAF19",null,null,"Bermuda","CONCACAF",982.42640032381507,166]
[167,"Nepal","AFC",978.85970542520352,"AFC35",null,null,"Nepal","AFC",978.85970542520352,167]
[168,"Vanuatu","OFC",978.2953727494322,"OFC7",null,null,"Vanuatu","OFC",978.2953727494322,168]
[169,"Malta","UEFA",971.56390111336134,"UEFA51",null,null,"Malta","UEFA",971.56390111336134,169]
[170,"Grenada","CONCACAF",968.49313963140571,"CONCACAF20",null,null,"Grenada","CONCACAF",968.49313963140571,170]
[171,"Cambodia","AFC",966.61166579962025,"AFC36",null,null,"Cambodia","AFC",966.61166579962025,171]
[172,"Puerto Rico","CONCACAF",962.76949956059752,"CONCACAF21",null,null,"Puerto Rico","CONCACAF",962.76949956059752,172]
[173,"Belize","CONCACAF",962.20686440532927,"CONCACAF22",null,null,"Belize","CONCACAF",962.20686440532927,173]
[174,"Guyana","CONCACAF",961.09904122698936,"CONCACAF23",null,null,"Guyana","CONCACAF",961.09904122698936,174]
[175,"St. Vincent and Grenadines","CONCACAF",960.70546546482308,"CONCACAF24",null,null,"St. Vincent and Grenadines","CONCACAF",960.70546546482308,175]
[176,"St. Lucia","CONCACAF",953.45479205558354,"CONCACAF25",null,null,"St. Lucia","CONCACAF",953.45479205558354,176]
[177,"Cuba","CONCACAF",950.91421190676385,"CONCACAF26",null,null,"Cuba","CONCACAF",950.91421190676385,177]
[178,"Montserrat","CONCACAF",950.70836545718657,"CONCACAF27",null,null,"Montserrat","CONCACAF",950.70836545718657,178]
[179,"Mauritius","CAF",940.47039449143563,"CAF48",null,null,"Mauritius","CAF",940.47039449143563,179]
[180,"Moldova","UEFA",932.79341617440537,"UEFA52",null,null,"Moldova","UEFA",932.79341617440537,180]
[181,"Chad","CAF",931.9839950515892,"CAF49",null,null,"Chad","CAF",931.9839950515892,181]
[182,"Macau","AFC",922.09982685745092,"AFC37",null,null,"Macau","AFC",922.09982685745092,182]
[183,"Sao Tome e Principe","CAF",917.62005630611895,"CAF50",null,null,"Sao Tome e Principe","CAF",917.62005630611895,183]
[184,"Dominica","CONCACAF",916.71856439735166,"CONCACAF28",null,null,"Dominica","CONCACAF",916.71856439735166,184]
[185,"Mongolia","AFC",911.4932721422839,"AFC38",null,null,"Mongolia","AFC",911.4932721422839,185]
[186,"Bhutan","AFC",910.9632526238604,"AFC39",null,null,"Bhutan","AFC",910.9632526238604,186]
[187,"Laos","AFC",909.7159173890351,"AFC40",null,null,"Laos","AFC",909.7159173890351,187]
[188,"Bangladesh","AFC",903.97910793134042,"AFC41",null,null,"Bangladesh","AFC",903.97910793134042,188]
[189,"Brunei Darussalam","AFC",903.90390082822375,"AFC42",null,null,"Brunei Darussalam","AFC",903.90390082822375,189]
[190,"American Samoa","OFC",900.27428698031019,"OFC8",null,null,"American Samoa","OFC",900.27428698031019,190]
[191,"Cook Islands","OFC",899.32573563834319,"OFC9",null,null,"Cook Islands","OFC",899.32573563834319,191]
[192,"Liechtenstein","UEFA",895.07562348094666,"UEFA53",null,null,"Liechtenstein","UEFA",895.07562348094666,192]
[193,"Samoa","OFC",894.2552847284594,"OFC10",null,null,"Samoa","OFC",894.2552847284594,193]
[194,{"$f":"INDEX($H$2:$H$212,MATCH(A195,$K$2:$K$212,0))","v":"Djibouti"},{"$f":"VLOOKUP($B195,$H$2:$K$212,2,FALSE)","v":"CAF"},{"$f":"VLOOKUP($B195,$H$2:$K$212,3,FALSE)","v":875.97560352099003},{"$f":"$C195&(COUNTIFS($C$2:$C$212,$C195,$A$2:$A$212,\"<\"&$A195)+1)","v":"CAF51"},null,null,"Djibouti","CAF",875.97560352099003,{"$f":"RANK(J195,$J$2:$J$212)","v":194}]
[195,"Cayman Islands","CONCACAF",873.64192269650528,"CONCACAF29",null,null,"Cayman Islands","CONCACAF",873.64192269650528,195]
[196,"Seychelles","CAF",866.8306593199195,"CAF52",null,null,"Seychelles","CAF",866.8306593199195,196]
[197,"Pakistan","AFC",866.80524883874432,"AFC43",null,null,"Pakistan","AFC",866.80524883874432,197]
[198,"Timor-Leste","AFC",865.47422619938868,"AFC44",null,null,"Timor-Leste","AFC",865.47422619938868,198]
[199,"Tonga","OFC",861.80532386009202,"OFC11",null,null,"Tonga","OFC",861.80532386009202,199]
[200,"Aruba","CONCACAF",859.97062179573606,"CONCACAF30",null,null,"Aruba","CONCACAF",859.97062179573606,200]
[201,"Bahamas","CONCACAF",858.5012669331926,"CONCACAF31",null,null,"Bahamas","CONCACAF",858.5012669331926,201]
[202,"Somalia","CAF",857.48999111561284,"CAF53",null,null,"Somalia","CAF",857.48999111561284,202]
[203,"Gibraltar","UEFA",857.20345748933744,"UEFA54",null,null,"Gibraltar","UEFA",857.20345748933744,203]
[204,"Eritrea","CAF",855.5620183473452,"CAF54",null,null,"Eritrea","CAF",855.5620183473452,204]
[205,"Sri Lanka","AFC",842.9294704215414,"AFC45",null,null,"Sri Lanka","AFC",842.9294704215414,205]
[206,"Turks and Caicos Islands","CONCACAF",839.84251951814849,"CONCACAF32",null,null,"Turks and Caicos Islands","CONCACAF",839.84251951814849,206]
[207,"Guam","AFC",838.32696910181505,"AFC46",null,null,"Guam","AFC",838.32696910181505,207]
[208,"US Virgin Islands","CONCACAF",816.1333359666213,"CONCACAF33",null,null,"US Virgin Islands","CONCACAF",816.1333359666213,208]
[209,"British Virgin Islands","CONCACAF",812.94369886824359,"CONCACAF34",null,null,"British Virgin Islands","CONCACAF",812.94369886824359,209]
[210,"Anguilla","CONCACAF",792.34135912894362,"CONCACAF35",null,null,"Anguilla","CONCACAF",792.34135912894362,210]
[211,"San Marino","UEFA",776.96752905965786,"UEFA55",null,null,"San Marino","UEFA",776.96752905965786,211]